program: Gaussian 09
title: 000281095
version: EM64L-G09RevD.01
frameworkgroup: C1[X(C17H16N4)]
method: RPBEPBE
basis: SDD
operation: Freq
keyword: #pfreq=noraman
keyword: PBEPBE/SDD
title: #p freq=noraman PBEPBE/SDD
converged: YES YES NO NO
title: Mulliken charges:
elementType: N N N N C C C C C C C C C C C C C C C C C H H H H H H H H H H H H H H H H
charge: -0.262853 -0.134298 -0.054894 -0.616020 0.109075 0.358854 -0.267392 0.137746 0.080423 0.337958 -0.370533 -0.390853 -0.794983 -0.371616 -0.359487 -0.236414 -0.232375 -0.249228 -0.235605 -0.225754 -0.234748 0.264055 0.210706 0.277652 0.250439 0.248052 0.249968 0.222462 0.249251 0.220273 0.222648 0.224992 0.228462 0.228616 0.331180 0.352108 0.232134
chargesum: 0.00000
title: Mulliken charges with hydrogens summed into heavy atoms:
elementType: N N N N C C C C C C C C C C C C C C C C C
charge: -0.262853 -0.134298 -0.054894 0.067268 0.109075 0.358854 -0.003336 0.137746 0.080423 0.337958 -0.159827 -0.113201 -0.046524 -0.149155 -0.110236 -0.016140 -0.009727 -0.024236 -0.007144 0.002862 -0.002614
polarizability: 4.72032611e+02 7.93165963e+00 2.15456054e+02 1.31225908e+00 6.18477809e+00 9.30466547e+01
1716.lowfreq: -17.2020 -5.0031 -1.1004 -0.0009 -0.0007 0.0004 5.0345 30.0705 48.8263
frequency: -14.8783 29.9933 48.7949 54.4400 70.0283 99.7762 112.6005 162.5072 183.3692 210.7157 232.9161 243.7596 287.5403 303.8842 328.0827 354.4684 381.6799 389.9356 404.4933 404.7902 436.1909 481.6327 486.2885 504.5079 527.7653 567.3767 608.0989 615.6459 616.2078 621.8845 658.5312 686.0554 688.1650 697.1565 700.8515 705.8508 756.2692 771.2421 781.6840 816.8927 847.9746 850.9522 907.8043 922.8938 926.2875 973.9816 977.3575 977.5928 987.6421 988.0800 997.4143 1000.8675 1002.3025 1021.4293 1026.2603 1028.4991 1071.3457 1077.4017 1086.2172 1096.4597 1137.4687 1170.1067 1173.2527 1181.8069 1186.1052 1192.5355 1266.3161 1285.3661 1310.0450 1315.2292 1329.7830 1377.4113 1380.4532 1389.2047 1397.4944 1433.2784 1438.2272 1469.3767 1471.4960 1477.4807 1493.2572 1540.9598 1552.3952 1563.7265 1584.9601 1586.2261 1611.2108 1616.3763 1652.1156 2986.9794 3067.1833 3117.3996 3120.4063 3126.9246 3126.9407 3134.3703 3139.7798 3147.3268 3155.8708 3159.3496 3168.2061 3170.4915 3299.3015 3558.2101 3722.3651
redmass: 3.6782 4.0586 4.0581 5.0325 3.3379 4.8210 5.1329 3.9077 3.5487 1.7669 4.8946 3.4445 3.4776 3.6845 4.3223 2.4122 4.3851 1.6733 2.8196 2.8109 4.1931 3.5647 1.1456 3.5306 4.1589 3.1563 4.6267 6.3135 6.3655 1.3021 6.6195 4.5156 6.4810 1.8518 2.0321 3.4963 4.0279 1.8629 2.1635 5.1185 1.2557 1.2586 7.7124 1.4128 1.4536 2.0487 1.5002 1.3616 5.9658 4.6340 1.3370 1.3301 2.7324 2.3687 1.9479 1.6481 2.0755 1.6175 1.6488 2.4506 4.9831 1.0704 1.0569 1.7218 1.1660 1.2147 3.6501 3.2869 2.2287 1.4899 1.9815 5.0951 7.2611 1.5139 2.8889 2.2965 2.3753 1.3614 2.0665 1.2833 1.4330 1.3780 4.7422 6.3991 6.2202 6.2557 6.4335 5.9671 6.1173 1.0394 1.0982 1.0848 1.0956 1.0855 1.0869 1.0879 1.0937 1.0930 1.0968 1.0957 1.0984 1.1003 1.0978 1.0445 1.1046
irintensity: 0.0408 0.1099 0.0567 0.1421 0.8546 0.5625 0.8546 2.4942 2.4704 4.2446 2.0633 5.3326 3.5302 1.0878 0.5814 37.7685 14.4648 160.9763 0.8136 4.9649 20.2749 10.8347 70.0343 3.0067 4.1312 12.1058 6.6873 0.3924 0.1923 8.7908 17.3409 11.5175 7.6164 46.3591 33.7259 88.8673 2.6974 58.5398 28.2739 4.3973 0.5537 0.1998 8.0993 3.8532 5.0916 2.8135 2.1065 0.2350 0.7783 0.0879 0.4003 1.0580 8.2792 8.5058 24.6608 7.7817 1.1239 5.0198 14.1006 17.8984 20.9741 3.3549 2.2600 177.5291 15.7247 24.1789 39.1467 26.5060 12.8222 7.2082 35.2418 118.7352 0.8722 46.5734 174.1739 11.7332 18.4666 12.3318 34.4749 14.4357 14.2795 25.8643 32.3662 60.4701 0.0977 20.5728 4.5510 21.5964 428.1650 9.6700 8.5247 9.3712 25.0453 1.1482 3.4706 0.9250 38.3823 27.0672 34.3787 33.5178 22.8251 20.7014 11.7504 65.9818 78.2269
temp: 298.150 k
press: 1.00000 atm
elementType: 7 7 7 7 6 6 6 6 6 6 6 6 6 6 6 6 6 6 6 6 6 1 1 1 1 1 1 1 1 1 1 1 1 1 1 1 1
symmnumber: 1
zpe: 769112.7 jmol-1
zpe.correction: 0.292940 hartree
zpe.thermalcorrener: 0.310219 hartree
zpe.thermalcorrenthalpy: 0.311163 hartree
zpe.thermalcorrgfe: 0.247325 hartree
zpe.sumelectzpe: -874.925699 hartree
zpe.sumelectthermal: -874.908420 hartree
zpe.sumelectthermalent: -874.907475 hartree
zpe.sumelectthermalfe: -874.971313 hartree
dipole: -4.0988 -1.4582 -0.0041
dipole: 4.3505
quadrupole: -111.6358 -103.5894 -130.6929
quadrupole: -3.7251 0.7408 1.2235
quadrupole: 3.6702 11.7166 -15.3868 -3.7251 0.7408 1.2235
hfenergy: -875.2186384 hartree
pointgroup: C01 [X(C17H16N4)]
dipole: 1.6205827 -0.4143471 0.3628788 debye
polarizability: 472.193087|-1.5335308|157.6321693|4.7694494|-61.3254111|150.7100632 unknown
InChI: InChI=1S/C17H16N4/c1-13(14-8-4-2-5-9-14)20-21-12-16(19-17(21)18)15-10-6-3-7-11-15/h2-12H,18H2,1H3
charge 0 multiplicity 1
37 atoms
N  0.038083 0.472946 -0.253511
N  -1.907695 1.438922 -0.968187
N  1.420334 0.445013 -0.22713
N  0.200611 2.43166 -1.663469
C  -2.204187 0.310381 -0.149467
C  -3.599205 -0.069284 0.119439
C  -1.033824 -0.295684 0.30239
C  -0.573002 1.510784 -1.007972
C  2.146419 -0.439506 0.439055
C  3.62231 -0.268188 0.286844
C  -3.931917 -1.197356 0.920819
C  -4.653508 0.708839 -0.433735
C  1.610009 -1.578437 1.293215
C  4.528192 -0.712792 1.290141
C  4.159016 0.357769 -0.875487
C  -5.27875 -1.53516 1.162792
C  -6.000429 0.368651 -0.190193
C  -6.322015 -0.754006 0.608916
C  5.920361 -0.529686 1.140712
C  5.548159 0.534255 -1.026084
C  6.438589 0.091608 -0.01778
H  -0.877503 -1.151311 0.943344
H  -3.136614 -1.814385 1.355915
H  -4.38583 1.57314 -1.049228
H  0.952422 -2.233463 0.693045
H  1.026823 -1.206758 2.156165
H  2.427417 -2.206265 1.674639
H  4.152739 -1.176986 2.208605
H  3.467822 0.684223 -1.658313
H  -5.517948 -2.407328 1.782191
H  -6.801343 0.978678 -0.623563
H  -7.368626 -1.018122 0.797754
H  6.598883 -0.869787 1.930826
H  5.940862 1.006793 -1.933411
H  -0.252276 3.173495 -2.186017
H  1.211356 2.374383 -1.561718
H  7.519367 0.22556 -0.136541
