program: Gaussian 09
title: 000281140
version: EM64L-G09RevD.01
frameworkgroup: C1[X(C14H27O6P)]
method: RPBEPBE
basis: SDD
operation: Freq
keyword: #p
keyword: freq=noraman
keyword: PBEPBE/SDD
title: #p freq=noraman PBEPBE/SDD
converged: NO YES NO NO
title: Mulliken charges:
elementType: P O O O O O O C C C C C C C C C C C C C C H H H H H H H H H H H H H H H H H H H H H H H H H H H
charge: 1.398578 -0.561859 -0.262526 -0.501574 -0.514430 -0.234792 -0.616380 0.062214 0.220023 -0.717419 -0.714682 0.192006 0.257490 -0.788779 -0.780786 -0.261530 -0.218888 -0.253225 -0.664118 -0.659573 -0.641770 0.261498 0.246009 0.217878 0.256400 0.211506 0.231294 0.243006 0.218547 0.241327 0.218913 0.264769 0.213331 0.235657 0.221697 0.224220 0.242535 0.225762 0.235484 0.246043 0.224385 0.217157 0.236597 0.232062 0.208834 0.247373 0.224964 0.214771
chargesum: 0.00000
title: Mulliken charges with hydrogens summed into heavy atoms:
elementType: P O O O O O O C C C C C C C C C C C C C C
charge: 1.398578 -0.561859 -0.262526 -0.501574 -0.514430 -0.234792 -0.616380 0.062214 0.220023 0.007967 -0.015482 0.192006 0.257490 -0.085898 -0.083774 0.195825 0.247867 0.208021 0.023468 0.017921 0.045337
polarizability: 2.33103521e+02 -9.22668217e+00 1.88485425e+02 -8.18553600e-01 5.15034262e+00 1.81321429e+02
1716.lowfreq: -9.8947 -1.9327 0.0005 0.0006 0.0014 9.2541 15.2543 23.6901 32.9042
frequency: 14.3350 23.1418 32.8656 34.9164 39.7173 53.1341 56.6103 62.8339 68.2537 90.2484 91.0418 109.1908 119.6545 123.0301 142.9226 166.0572 180.0085 196.0977 198.8230 211.8816 218.2105 235.6464 247.7540 251.7374 260.0808 262.3439 274.4655 285.5262 310.3486 323.9662 330.1435 337.2318 354.2781 372.5656 383.9824 386.4764 414.8335 432.8747 451.1864 486.8165 509.3427 551.7163 593.0013 628.6695 676.5022 697.1709 724.1284 732.1607 767.5280 800.3985 811.8142 815.5800 846.5199 857.0033 879.1025 893.2282 946.1939 950.9603 958.8382 972.3892 1006.7535 1011.8888 1014.3218 1023.3977 1033.4653 1047.1840 1081.0673 1090.9638 1094.2729 1095.6007 1099.2524 1106.5314 1131.8222 1141.7275 1146.5223 1155.2455 1205.7169 1227.3561 1250.7241 1265.6938 1272.8971 1279.4665 1354.0851 1354.2274 1355.8415 1378.8865 1386.4638 1389.0331 1390.6351 1395.4068 1396.1100 1405.1568 1453.9589 1456.1062 1456.6307 1456.8396 1459.4515 1460.6653 1463.8455 1465.0097 1467.9782 1477.2893 1479.2360 1480.5203 1481.0963 1484.3101 1485.6528 1490.0745 1494.2545 1623.2018 1673.7652 2966.3847 2971.1518 2987.4622 2991.1797 2992.1126 2994.7085 2994.8039 3002.6646 3013.7107 3027.9792 3033.3114 3044.3426 3070.1212 3080.3668 3083.9433 3085.6548 3089.0961 3090.3990 3091.3801 3091.9630 3098.5780 3103.7891 3109.9652 3113.1082 3116.4108 3116.9163 3132.6864
redmass: 4.1310 3.0270 3.3603 3.4345 3.2949 2.2374 2.5184 3.5416 3.2495 3.7578 3.9592 1.6494 3.2029 1.7420 2.9139 3.3646 2.6249 2.2995 1.7447 1.8417 2.0188 1.4509 1.4725 2.1832 2.1301 2.3541 1.4964 1.0573 2.7225 2.8776 3.0705 5.2314 5.2857 2.8668 3.4831 4.5703 3.8215 3.5577 3.9318 4.1583 5.5721 4.8371 5.3316 5.6777 5.1980 5.9414 6.7812 4.3839 3.0947 1.1246 1.0862 1.4678 3.2324 3.7963 4.5146 2.9099 1.6703 1.9483 1.3341 1.2703 2.6947 2.5856 2.5654 1.3787 3.4324 9.1201 1.6767 3.5814 2.1680 2.0909 2.2316 2.2714 1.4013 1.5612 3.2173 1.7278 2.8688 3.3542 1.1547 4.3892 1.1164 1.1165 1.2131 1.2598 1.2440 1.1735 1.2219 1.2323 1.2314 1.2455 1.2096 1.1862 1.0835 1.0703 1.0593 1.0406 1.0480 1.0691 1.0499 1.0448 1.0632 1.0549 1.0505 1.0546 1.0543 1.0542 1.0512 1.0867 1.0509 9.4299 7.1366 1.0400 1.0392 1.0360 1.0358 1.0349 1.0360 1.0358 1.0571 1.0602 1.0589 1.0968 1.0966 1.1072 1.1032 1.0980 1.0978 1.1005 1.1030 1.1001 1.0977 1.0967 1.0996 1.1047 1.1028 1.1060 1.1019 1.0944
irintensity: 1.2590 0.7846 0.7756 0.3363 0.0110 2.0936 2.8950 0.3354 1.3277 1.3799 0.3392 0.7446 2.7809 0.2081 1.1607 3.0893 1.8684 1.1788 3.2423 2.2140 3.9738 4.1118 0.3369 4.6024 5.3609 6.4384 1.9311 0.3510 6.3765 2.4911 3.6300 9.4687 31.5655 2.7270 3.7675 23.9214 22.5852 4.3442 17.9595 9.3386 13.1529 10.9871 39.8327 42.2370 43.3258 108.2196 2.7877 84.1642 62.7600 3.6421 2.2554 1.2585 7.7178 140.0694 212.6375 13.4084 16.9800 12.6845 7.3316 1.7469 164.9888 17.4993 223.8249 8.2222 235.2722 177.0501 6.3417 136.2642 0.8546 24.2151 52.4350 13.2961 3.8469 8.4667 6.5963 14.4868 17.0014 30.6390 0.4745 4.6541 0.1125 2.7260 9.8471 0.3981 3.4556 17.0520 16.5433 25.6242 19.8517 24.5955 22.2393 6.5453 8.2589 7.3402 16.9478 6.9740 2.4913 6.9722 6.6564 28.4515 6.1435 11.8225 10.0280 21.5876 29.2084 1.5174 7.6775 11.1919 15.3684 116.1460 1.1755 17.2870 55.8526 14.8649 18.0706 22.6103 15.5220 22.2891 23.2869 35.1896 35.0688 18.8114 24.3017 7.4969 5.3596 37.6695 38.7680 9.2007 3.6791 15.6297 25.3019 34.6634 19.2533 30.1405 35.0571 23.9918 17.7875 10.1829
temp: 298.150 k
press: 1.00000 atm
elementType: 15 8 8 8 8 8 8 6 6 6 6 6 6 6 6 6 6 6 6 6 6 1 1 1 1 1 1 1 1 1 1 1 1 1 1 1 1 1 1 1 1 1 1 1 1 1 1 1
symmnumber: 1
zpe: 1038593.5 jmol-1
zpe.correction: 0.395579 hartree
zpe.thermalcorrener: 0.423621 hartree
zpe.thermalcorrenthalpy: 0.424565 hartree
zpe.thermalcorrgfe: 0.334449 hartree
zpe.sumelectzpe: -1340.524605 hartree
zpe.sumelectthermal: -1340.496564 hartree
zpe.sumelectthermalent: -1340.495620 hartree
zpe.sumelectthermalfe: -1340.585736 hartree
dipole: -0.4449 2.3407 2.1400
dipole: 3.2025
quadrupole: -111.7629 -126.9868 -142.1921
quadrupole: 0.8472 10.2570 0.6632
quadrupole: 15.2177 -0.0062 -15.2115 0.8472 10.2570 0.6632
hfenergy: -1340.9201848 hartree
pointgroup: C01 [X(C14H27O6P1)]
dipole: -0.0338254 1.1479929 0.5181668 debye
polarizability: 230.2671834|-13.9122166|193.661464|2.2542007|1.8252983|178.9817284 unknown
InChI: InChI=1S/C14H27O6P/c1-8-17-13(15)14(6,7)12(11(4)5)20-21(16,18-9-2)19-10-3/h8-10H2,1-7H3
charge 0 multiplicity 1
48 atoms
P  2.317221 -0.591828 -0.576391
O  0.989591 -0.551784 0.546912
O  -3.675187 -0.184534 -0.771147
O  3.187982 -1.904851 0.086449
O  3.212048 0.827044 -0.13306
O  -2.822367 -0.736738 1.322643
O  2.03166 -0.743412 -2.130469
C  -1.253174 -0.432748 -0.589836
C  -0.205793 0.226128 0.336258
C  -0.949734 -1.952539 -0.813912
C  -1.276423 0.279691 -1.972652
C  -2.627808 -0.443977 0.121099
C  -0.330232 1.400544 1.020823
C  -1.589814 2.247453 0.972686
C  0.747161 1.931944 1.945301
C  -5.061811 -0.289849 -0.217886
C  3.50947 -1.93404 1.552328
C  3.844875 1.636496 -1.224689
C  -5.51105 1.046559 0.37914
C  4.305394 -3.215091 1.775285
C  2.881222 2.704768 -1.742296
H  -0.033897 -2.070679 -1.416416
H  -0.826771 -2.480184 0.145457
H  -1.784566 -2.409731 -1.375375
H  -0.277348 0.187719 -2.434763
H  -1.527791 1.35008 -1.878983
H  -2.019276 -0.189199 -2.63869
H  -2.260862 2.007741 0.133102
H  -1.319892 3.317876 0.894767
H  -2.166154 2.121272 1.910612
H  0.335222 2.056924 2.966593
H  1.623805 1.271504 1.993768
H  1.087746 2.932453 1.612786
H  -5.077274 -1.092733 0.539958
H  -5.66754 -0.576378 -1.092803
H  4.096054 -1.02992 1.802011
H  2.560415 -1.926421 2.117126
H  4.72704 2.077329 -0.731126
H  4.174068 0.965169 -2.039361
H  -4.901471 1.306544 1.260954
H  -5.432071 1.858053 -0.365169
H  -6.567138 0.975153 0.699766
H  3.70836 -4.097523 1.49029
H  5.23183 -3.210382 1.176669
H  4.576169 -3.304255 2.843924
H  2.021731 2.24207 -2.257404
H  2.508993 3.328861 -0.911515
H  3.403588 3.360622 -2.464462
