program: Gaussian 09
title: 000281035
version: EM64L-G09RevD.01
frameworkgroup: C1[X(C9H9N3)]
method: RPBEPBE
basis: SDD
operation: Freq
keyword: #p
keyword: freq=noraman
keyword: PBEPBE/SDD
title: #p freq=noraman PBEPBE/SDD
converged: NO YES NO NO
title: Mulliken charges:
elementType: N N N C C C C C C C C C H H H H H H H H H
charge: -0.208519 -0.076613 -0.118998 0.447806 -0.325974 0.171809 -0.340536 -0.349606 -0.220918 -0.203358 -0.737840 -0.243804 0.273223 0.226359 0.291795 0.230144 0.233519 0.247026 0.223359 0.246997 0.234129
chargesum: 0.00000
title: Mulliken charges with hydrogens summed into heavy atoms:
elementType: N N N C C C C C C C C C
charge: -0.208519 -0.076613 -0.118998 0.447806 -0.052750 0.171809 -0.114178 -0.057811 0.009226 0.030160 -0.020458 -0.009675
polarizability: 1.87351882e+02 -1.59155028e+00 1.13846811e+02 2.16990393e-02 -2.11907275e-02 5.07000811e+01
1716.lowfreq: -18.5411 -15.0871 -5.8142 -0.0006 -0.0003 0.0003 4.1213 27.2961 88.9237
frequency: -18.4427 27.0150 88.9150 141.8606 214.3730 302.3153 316.9336 341.5218 401.4923 454.9724 508.4612 612.8937 630.1587 642.4122 663.6560 692.6689 707.2941 767.6692 781.2584 840.7836 893.1487 922.5234 954.7011 974.3427 977.2513 987.8397 1000.6590 1006.9194 1027.2652 1047.8992 1082.2046 1145.3567 1174.4471 1187.8429 1195.1239 1207.3481 1286.1352 1328.3108 1386.8158 1395.7213 1405.9741 1452.4332 1459.8159 1472.7896 1496.8999 1553.8161 1599.4780 1614.4168 2994.6325 3077.6737 3102.2544 3134.9524 3144.8681 3158.2439 3171.0011 3186.8232 3265.4129
redmass: 3.5157 1.0944 4.4153 3.9580 3.5718 3.6720 4.8692 5.5414 2.8494 4.7888 3.2752 6.4373 2.8615 5.4812 6.8842 2.0462 4.9734 1.6820 1.5373 1.2563 6.7462 1.4195 2.7968 4.0843 1.3659 6.1341 1.3202 2.6280 2.1234 1.4827 1.6024 3.4568 1.0597 1.3650 5.1900 1.4576 3.9627 1.4142 5.7167 3.2982 1.4321 2.3983 1.0436 1.1310 2.7447 5.5280 6.6814 6.1280 1.0369 1.0983 1.0994 1.0852 1.0892 1.0939 1.0990 1.0967 1.1001
irintensity: 5.3282 1.4892 0.0855 2.9565 0.1272 2.1762 0.7883 1.1413 0.0037 1.0800 13.1348 0.2963 0.1775 1.5172 3.4672 37.1581 4.8809 81.3886 34.1080 0.0003 91.5334 7.9970 21.5022 1.1716 0.2654 0.9682 1.3439 22.6405 5.9057 7.8241 8.3628 10.7042 0.1769 11.3443 36.2173 9.2006 19.7908 8.8560 1.5689 12.0104 19.9826 11.4714 14.2772 28.3860 99.5233 10.0400 4.8324 40.7515 27.7175 14.8994 15.5894 1.5994 9.4378 30.8112 14.1781 3.3686 0.7454
temp: 298.150 k
press: 1.00000 atm
elementType: 7 7 7 6 6 6 6 6 6 6 6 6 1 1 1 1 1 1 1 1 1
symmnumber: 1
zpe: 428322.9 jmol-1
zpe.correction: 0.163140 hartree
zpe.thermalcorrener: 0.172408 hartree
zpe.thermalcorrenthalpy: 0.173353 hartree
zpe.thermalcorrgfe: 0.127372 hartree
zpe.sumelectzpe: -511.729056 hartree
zpe.sumelectthermal: -511.719787 hartree
zpe.sumelectthermalent: -511.718843 hartree
zpe.sumelectthermalfe: -511.764824 hartree
dipole: -1.7343 3.9820 -0.0008
dipole: 4.3432
quadrupole: -60.0957 -67.7632 -74.1797
quadrupole: 8.8803 -0.0028 -0.0046
quadrupole: 7.2505 -0.4170 -6.8335 8.8803 -0.0028 -0.0046
hfenergy: -511.8921954 hartree
pointgroup: C01 [X(C9H9N3)]
dipole: -0.7121545 1.5532866 0.0005654 debye
dipolederiv: -1.0839747 0.1701088 -0.0007207 0.2849423 -0.1267722 -0.0006897 0.0026962 -0.000287 0.0582914 0.4178479 -0.3873722 0.0003019 -0.5576943 -0.032837 0.0016438 0.0007277 -0.0005743 -0.1673527 -0.8766282 0.2000571 0.0004769 -0.4107074 0.0143002 -0.0007651 -0.0016014 0.0004057 -0.202544 1.1631234 -0.0756289 -0.0004372 -0.0370331 0.0561648 0.0001064 -0.0019348 -0.0000083 0.0762773 0.2787233 -0.0930043 -0.0001713 0.2397488 -0.1067342 -0.0004705 -0.0003612 0.0001283 -0.1548253 0.3452068 0.191817 0.000805 0.5308603 -0.0296133 -0.0000357 0.000398 0.0002039 -0.0053088 -0.185805 0.0464021 0.0000062 0.1544176 -0.02009 0.0000355 0.0004875 0.000031 -0.1662339 -0.2650214 -0.0403676 -0.0000419 -0.1492194 -0.022507 0.0001326 0.0002252 0.0001177 -0.1377882 -0.012664 -0.0420464 -0.0000573 -0.1332655 0.1157268 0.0002032 -0.00001 0.0002384 -0.150109 0.0897858 0.0788574 -0.0000319 0.1050423 0.1244339 0.0000631 0.0000353 0.0000507 -0.1455474 -0.1323084 -0.0804396 -0.0003648 0.0033129 0.0770468 -0.0000031 -0.0007832 -0.0001133 0.0664627 0.0129017 -0.0124403 -0.0001054 0.0426483 -0.103983 0.0000231 0.0000113 0.0000324 -0.1645745 0.1385534 0.05105 -0.000008 0.028803 0.0243212 0.0001635 -0.0002023 -0.000041 0.2144147 0.0315852 -0.108364 0.0000029 -0.106817 -0.0199906 -0.0000706 -0.0001085 -0.0000005 0.1636626 0.1277094 0.0607832 0.0000274 0.0547496 0.0414994 -0.0000815 -0.0000787 -0.0000898 0.1727747 0.031604 0.0720499 0.000097 0.0975937 -0.0734757 -0.0001604 0.0000461 -0.0001889 0.1585873 0.013177 -0.0838705 0.0000234 -0.104739 -0.049917 -0.0000627 -0.0000378 -0.0000308 0.1554304 -0.0152826 -0.0053869 0.0757067 0.0023699 0.0852181 -0.0722153 0.1285478 -0.04093 -0.0288558 0.0624018 0.0524985 -0.00015 -0.0595772 -0.1316333 0.0002268 0.0000598 0.0004097 0.119441 -0.0144454 -0.005644 -0.0755003 0.0017518 0.0855548 0.0720006 -0.128225 0.0406917 -0.0297034 -0.1264899 0.0109407 0.0001413 0.0128123 0.0932872 -0.0000441 0.0001081 -0.0000454 0.1675011 unknown
polarizability: 187.3858657|-0.1848063|113.8128359|-0.0050012|0.0085397|50.7000721 unknown
InChI: InChI=1S/C9H9N3/c1-8-7-12(11-10-8)9-5-3-2-4-6-9/h2-7H,1H3
charge 0 multiplicity 1
21 atoms
N  0.628197 -0.070115 -0.001906
N  1.262463 -1.345344 -0.003984
N  2.585919 -1.112788 -0.000451
C  -0.801255 0.019265 -0.00083
C  1.587321 0.928352 -0.004171
C  2.823083 0.271101 -0.001243
C  -1.442676 1.281845 0.000111
C  -1.567599 -1.172447 -0.001115
C  -2.852218 1.348006 0.000811
C  -2.974276 -1.090697 -0.00035
C  4.214232 0.832696 0.000504
C  -3.625317 0.165299 0.000619
H  1.354205 1.987067 -0.005422
H  -0.86152 2.209308 0.000264
H  -1.051476 -2.135414 -0.00192
H  -3.343951 2.326612 0.00152
H  -3.563999 -2.013568 -0.000549
H  4.776289 0.492448 -0.887232
H  4.198502 1.935069 -0.000821
H  4.77333 0.494513 0.8909
H  -4.718756 0.22119 0.001166
