program: Gaussian 09
title: 000281025
version: EM64L-G09RevD.01
frameworkgroup: C1[X(C17H19NO2)]
method: RPBEPBE
basis: SDD
operation: Freq
keyword: #p
keyword: freq=noraman
keyword: PBEPBE/SDD
title: #p freq=noraman PBEPBE/SDD
converged: YES YES NO NO
title: Mulliken charges:
elementType: O O N C C C C C C C C C C C C C C C C C H H H H H H H H H H H H H H H H H H H
charge: -0.446294 -0.288279 -0.124145 -0.275087 -0.269714 0.427494 0.460202 -0.648767 -0.401826 -0.348608 0.237596 -0.403301 -0.399650 -0.227984 -0.264322 -0.799640 -0.227482 -0.233197 -0.233708 -0.240563 0.263402 0.204795 0.286734 0.205858 0.249996 0.230824 0.254143 0.278752 0.231647 0.358423 0.231846 0.233307 0.267252 0.269675 0.221336 0.225288 0.229664 0.235823 0.228511
chargesum: 0.00000
title: Mulliken charges with hydrogens summed into heavy atoms:
elementType: O O N C C C C C C C C C C C C C C C C C
charge: -0.087871 -0.288279 -0.124145 -0.011684 -0.064919 0.427494 0.460202 0.093821 -0.171002 -0.094466 0.237596 -0.124549 -0.168003 0.003862 -0.031015 -0.041376 -0.002194 -0.003533 0.002115 -0.012053
polarizability: 2.54632725e+02 -1.89630030e+01 1.53335754e+02 -6.93446856e+00 -5.22584624e+00 1.62335018e+02
1716.lowfreq: -5.7785 -3.8184 -0.0009 -0.0008 -0.0007 7.3458 29.4909 44.7428 51.3166
frequency: 29.4891 44.6592 51.2637 52.7215 62.7643 76.5334 105.2760 128.9135 148.0949 168.1558 186.3144 220.3698 232.3562 256.3590 260.7380 297.8967 334.4204 366.8080 371.5211 403.8173 405.2748 413.7534 451.4940 471.1140 500.4061 544.9694 571.4342 591.5559 611.4066 616.1430 617.8949 641.2015 704.7909 707.4018 738.9710 762.2310 800.4770 809.3924 857.4296 860.1173 866.8309 924.0104 932.1605 946.9454 981.0775 982.4509 987.1293 990.4015 991.6507 996.2507 998.7025 1000.9480 1013.8551 1027.0112 1029.4596 1033.1556 1083.1155 1086.7261 1121.7222 1128.4043 1163.1995 1172.9086 1175.2341 1187.3233 1192.2250 1198.8277 1211.8491 1227.1679 1247.8472 1282.9640 1316.0931 1322.5117 1344.0317 1371.4907 1372.8808 1380.8390 1389.1005 1393.0033 1411.8559 1439.0001 1440.6955 1456.2629 1478.3572 1482.9724 1483.4383 1485.3920 1489.3466 1590.3707 1591.1341 1594.0111 1610.0390 1614.6969 2949.5670 2976.1747 2990.1446 3056.6824 3079.5545 3080.4513 3110.0125 3118.9256 3121.0775 3123.3501 3129.7456 3130.0071 3137.0032 3143.7122 3148.7657 3160.1274 3166.8077 3171.5749 3527.1880
redmass: 4.4286 4.0326 6.0888 4.7798 4.0518 3.2656 4.9444 1.1842 4.6957 2.7822 1.0602 4.2394 4.8363 4.1008 4.0459 4.3542 3.3378 1.4757 2.5746 2.8724 2.7076 4.4425 3.2190 5.0326 3.8645 3.1444 3.0964 5.4994 4.3569 6.2170 6.3147 5.4292 1.8702 1.9666 1.9401 1.8081 4.1341 2.9081 1.2603 1.2518 3.1592 1.4592 1.4955 2.6513 1.4086 1.3964 2.6900 5.3339 3.8345 3.7252 1.5516 1.3341 2.9398 2.1836 2.1691 1.6729 1.6219 1.6442 1.3326 2.2426 1.4497 1.0756 1.0596 1.1257 1.1937 2.9238 2.6244 1.6540 1.3887 1.6611 1.3385 1.3331 1.2592 2.2067 1.5940 2.4341 3.7029 2.0340 1.2646 2.1449 2.0439 1.1021 1.1402 1.9849 1.4762 1.4357 1.0784 6.3346 5.8249 6.1298 6.0259 6.1116 1.0822 1.0369 1.0389 1.0995 1.0962 1.0841 1.0978 1.0871 1.0878 1.0850 1.0981 1.0885 1.0902 1.0933 1.0955 1.0974 1.1013 1.0977 1.0653
irintensity: 0.2114 0.0593 1.7074 0.5597 0.1844 1.1592 2.9182 0.5862 4.4300 2.4386 0.9218 1.0847 1.3166 0.0787 3.3889 4.3150 24.7829 77.0624 23.1009 0.3806 8.2115 1.5865 6.6108 1.5271 11.4638 23.5780 3.0679 20.3391 15.6540 0.5923 1.2005 3.8354 49.3184 38.0438 57.3205 47.0120 3.5666 14.3474 0.4071 1.4686 1.8792 1.1502 3.7496 1.0936 0.5128 1.7009 28.0056 0.3763 19.4190 64.2041 23.5938 0.9663 9.9873 12.7925 1.8595 6.5938 11.7704 4.0969 0.0519 21.3038 60.4443 6.5226 0.9505 8.2472 4.0373 21.9818 30.8053 8.6118 10.4951 59.1863 38.6854 21.0999 5.5723 25.5004 22.2884 33.2625 10.5118 42.1697 77.8263 12.3084 12.6997 22.6573 6.5178 19.5975 28.8640 1.7604 12.6652 236.4931 7.2847 1.1745 4.7860 5.5448 26.1645 52.2533 10.0757 38.3825 9.1811 6.3500 1.1803 7.8366 6.5839 4.1362 7.9316 5.1089 5.2466 32.9366 30.1340 23.3408 24.4017 9.8643 19.9006
temp: 298.150 k
press: 1.00000 atm
elementType: 8 8 7 6 6 6 6 6 6 6 6 6 6 6 6 6 6 6 6 6 1 1 1 1 1 1 1 1 1 1 1 1 1 1 1 1 1 1 1
symmnumber: 1
zpe: 837600.6 jmol-1
zpe.correction: 0.319025 hartree
zpe.thermalcorrener: 0.338052 hartree
zpe.thermalcorrenthalpy: 0.338996 hartree
zpe.thermalcorrgfe: 0.270803 hartree
zpe.sumelectzpe: -862.950253 hartree
zpe.sumelectthermal: -862.931226 hartree
zpe.sumelectthermalent: -862.930282 hartree
zpe.sumelectthermalfe: -862.998475 hartree
dipole: 3.0840 -2.1654 0.4465
dipole: 3.7947
quadrupole: -101.0506 -142.4170 -107.6543
quadrupole: -0.7891 -2.5220 1.0436
quadrupole: 15.9900 -25.3763 9.3863 -0.7891 -2.5220 1.0436
hfenergy: -863.2692781 hartree
pointgroup: C01 [X(C17H19N1O2)]
dipole: -1.1880223 -0.8650567 -0.2629755 debye
polarizability: 252.4531362|24.0598978|153.7884209|-7.0854168|2.6806485|164.06194 unknown
InChI: InChI=1S/C17H19NO2/c1-13(19)18(2)16(14-9-5-3-6-10-14)17(20)15-11-7-4-8-12-15/h3-12,16-17,20H,1-2H3
charge 0 multiplicity 1
39 atoms
O  -0.060826 -2.414377 -0.275464
O  0.772773 3.412774 0.65477
N  -0.188674 1.29396 0.580674
C  -0.504189 0.025633 -0.123999
C  0.359115 -1.184756 0.407475
C  -2.011593 -0.277771 -0.098033
C  1.841758 -0.986404 0.129414
C  -0.643957 1.452019 1.976089
C  -2.831922 0.198131 -1.152515
C  -2.624109 -1.002967 0.9591
C  0.515669 2.358204 -0.00543
C  2.433169 -1.532571 -1.037076
C  2.637463 -0.215035 1.012146
C  -4.223828 -0.038486 -1.154729
C  -4.016494 -1.246933 0.958633
C  0.959078 2.222458 -1.461886
C  3.797582 -1.299042 -1.320083
C  4.000386 0.023667 0.725727
C  -4.821466 -0.764782 -0.098085
C  4.584565 -0.515063 -0.443883
H  -0.219324 0.150956 -1.180745
H  0.203316 -1.286718 1.503082
H  -0.297514 2.43782 2.322743
H  -0.219438 0.668627 2.632198
H  -1.745493 1.408169 2.040478
H  -2.374588 0.759133 -1.976895
H  -2.019573 -1.373451 1.796592
H  1.820731 -2.156327 -1.694533
H  2.198047 0.202354 1.925922
H  -1.047312 -2.497489 -0.204031
H  -4.840147 0.337166 -1.97893
H  -4.470255 -1.808857 1.782419
H  1.499628 3.144803 -1.719707
H  1.633845 1.361772 -1.613123
H  0.099732 2.117728 -2.150108
H  4.248246 -1.732228 -2.220394
H  4.602425 0.627907 1.413175
H  -5.90057 -0.95304 -0.100017
H  5.642144 -0.332479 -0.665372
