program: Gaussian 09
title: 000281020
version: EM64L-G09RevD.01
frameworkgroup: C1[X(C16H17NO)]
method: RPBEPBE
basis: SDD
operation: Freq
keyword: #p
keyword: freq=noraman
keyword: PBEPBE/SDD
title: #p freq=noraman PBEPBE/SDD
converged: YES YES NO NO
title: Mulliken charges:
elementType: O N C C C C C C C C C C C C C C C C H H H H H H H H H H H H H H H H H
charge: -0.464441 -0.091757 -0.410031 -0.433266 -0.303986 -0.260747 0.422604 0.426670 -0.398699 -0.425280 -0.444931 -0.366987 -0.247610 -0.233835 -0.243193 -0.221306 -0.228482 -0.241193 0.249453 0.232060 0.231187 0.239613 0.246948 0.219888 0.310318 0.231202 0.345450 0.234850 0.270198 0.225061 0.224542 0.226643 0.225513 0.225568 0.227975
chargesum: 0.00000
title: Mulliken charges with hydrogens summed into heavy atoms:
elementType: O N C C C C C C C C C C C C C C C C
charge: -0.118991 -0.091757 0.071482 0.037534 -0.057038 -0.040859 0.422604 0.426670 -0.088381 -0.194078 -0.210081 -0.096789 -0.022549 -0.009293 -0.016550 0.004207 -0.002914 -0.013218
polarizability: 1.79258798e+02 8.10089642e-01 1.84549919e+02 -1.51114904e+01 9.66424883e+00 1.51154961e+02
1716.lowfreq: -10.7887 -6.4181 0.0003 0.0005 0.0007 3.9064 28.1053 40.9493 50.1972
frequency: 27.6314 40.9435 50.1495 69.1459 96.0026 101.9136 171.7006 180.2440 211.3520 234.5315 260.0289 269.0736 287.8421 340.1252 373.9273 379.5567 404.3333 412.3180 481.2342 519.6657 580.3870 609.6398 615.6643 616.2650 688.7001 705.9116 713.3465 724.6678 764.7012 769.2276 791.5295 800.7394 822.0718 853.2251 861.4779 865.1886 919.7242 930.2272 940.3271 974.2037 976.3191 985.1391 988.7095 989.7619 991.0364 995.9638 1013.2736 1025.1893 1027.1780 1040.5468 1067.6643 1080.0563 1084.2656 1088.4035 1122.9813 1140.5373 1171.5820 1171.6502 1175.0764 1182.9864 1193.6408 1199.9450 1214.9728 1249.7559 1278.7811 1293.1608 1323.8303 1336.2215 1348.2781 1365.9194 1384.4495 1389.1454 1439.6443 1440.4505 1452.1917 1468.4064 1480.0416 1480.7343 1586.1461 1593.2614 1609.1526 1612.5636 2967.9256 2993.8117 3063.4638 3079.7151 3110.5334 3112.0093 3122.6340 3125.3703 3136.8378 3138.9914 3154.5395 3156.0609 3164.8094 3165.8214 3169.9334 3185.2512 3565.0620
redmass: 4.0745 4.6604 4.1416 3.3781 3.9525 4.1116 3.6221 4.3369 4.7627 4.2301 1.9271 3.8669 1.8909 3.3833 3.8407 4.3168 2.8086 2.9074 4.6555 3.4791 3.6990 5.7828 6.4164 6.3124 4.6782 1.6710 1.7605 3.4529 2.0851 3.2475 2.4901 1.2260 4.3343 1.2829 2.9814 1.3707 1.5334 1.4317 3.2224 1.3633 1.3958 1.8521 2.6363 3.6076 2.5682 1.3464 1.4711 2.3627 2.3986 2.2759 1.2959 1.5701 1.3731 1.6009 1.6293 1.4191 1.0597 1.0560 1.5726 1.1319 1.1498 2.2988 1.4124 2.8883 1.5398 1.5176 1.2826 1.4160 1.3934 1.6180 4.5947 3.7881 2.1360 2.0399 1.0948 1.2038 2.1752 2.3034 5.8855 6.0878 6.0105 6.1090 1.0839 1.0835 1.0514 1.0562 1.0872 1.0874 1.0868 1.0864 1.0931 1.0922 1.0957 1.0981 1.1166 1.0998 1.0971 1.1166 1.0661
irintensity: 0.0547 0.3808 0.8690 1.1396 0.2613 1.0238 2.1238 2.6721 1.3763 1.0277 74.7551 0.5717 79.9911 2.8619 1.6259 6.4335 0.3327 0.0867 8.9102 7.2743 39.4233 12.8621 0.8736 1.9569 15.4795 73.8556 71.6920 4.9932 17.5355 20.1099 19.3730 17.0744 5.1644 0.2820 15.9469 0.6303 5.7113 19.5106 9.6682 7.1878 0.4754 13.0269 6.2827 0.2090 4.1043 0.3825 1.7790 24.7388 6.8023 34.6492 1.8143 18.4162 10.7094 7.0076 2.0138 1.6222 0.1546 0.3442 30.3245 4.0195 3.3706 3.8825 4.6222 30.4454 4.4691 4.9345 6.3935 9.3287 9.4248 3.2499 0.3316 0.4695 9.3306 9.8202 9.7168 0.7341 15.1072 10.4603 1.0093 0.4866 2.4488 2.5174 27.5066 27.3195 29.4830 28.1109 7.2927 7.7951 1.8013 0.6732 31.5377 24.5158 31.8410 26.9894 7.4270 14.6419 8.3356 34.6469 6.5275
temp: 298.150 k
press: 1.00000 atm
elementType: 8 7 6 6 6 6 6 6 6 6 6 6 6 6 6 6 6 6 1 1 1 1 1 1 1 1 1 1 1 1 1 1 1 1 1
symmnumber: 1
zpe: 753233.0 jmol-1
zpe.correction: 0.286891 hartree
zpe.thermalcorrener: 0.302899 hartree
zpe.thermalcorrenthalpy: 0.303843 hartree
zpe.thermalcorrgfe: 0.242351 hartree
zpe.sumelectzpe: -748.514094 hartree
zpe.sumelectthermal: -748.498086 hartree
zpe.sumelectthermalent: -748.497142 hartree
zpe.sumelectthermalfe: -748.558633 hartree
dipole: 0.8698 0.7118 0.0339
dipole: 1.1245
quadrupole: -100.7342 -102.2254 -99.1275
quadrupole: -3.1185 -0.5731 0.2181
quadrupole: -0.0385 -1.5297 1.5682 -3.1185 -0.5731 0.2181
hfenergy: -748.800985 hartree
pointgroup: C01 [X(C16H17N1O1)]
dipole: -0.3609458 -0.251534 0.0466739 debye
polarizability: 182.8507058|-0.9963274|185.7830601|9.5836721|-8.2820758|146.3299114 unknown
InChI: InChI=1S/C16H17NO/c18-16(14-9-5-2-6-10-14)15(17-11-12-17)13-7-3-1-4-8-13/h1-10,15-16,18H,11-12H2
charge 0 multiplicity 1
35 atoms
O  0.233146 1.368448 1.843741
N  1.69284 2.141414 -0.633481
C  2.969635 1.993553 0.145944
C  2.976193 1.843935 -1.367935
C  0.619265 1.080909 -0.567335
C  -0.392966 1.545863 0.517367
C  1.079704 -0.377151 -0.49701
C  -1.746954 0.845755 0.424972
C  1.583548 -0.984198 0.687185
C  1.059425 -1.149277 -1.689274
C  -2.795563 1.447566 -0.315261
C  -1.979443 -0.400772 1.05933
C  2.047122 -2.318851 0.669727
C  1.521349 -2.484172 -1.70866
C  2.021071 -3.0747 -0.52525
C  -4.052056 0.811743 -0.433104
C  -3.236512 -1.034994 0.947057
C  -4.275898 -0.433286 0.199378
H  3.125059 1.084248 0.736498
H  3.324107 2.916955 0.615103
H  3.341745 2.655479 -2.005895
H  3.135221 0.831258 -1.76085
H  0.072102 1.201935 -1.523568
H  -0.530537 2.6310 0.323516
H  1.574685 -0.410616 1.617966
H  0.668616 -0.699589 -2.611297
H  -0.375973 1.747598 2.525855
H  -2.628866 2.419808 -0.797211
H  -1.171866 -0.866623 1.632768
H  2.427263 -2.770559 1.593546
H  1.488763 -3.060383 -2.640389
H  2.38136 -4.109733 -0.533892
H  -4.854788 1.28789 -1.007488
H  -3.405221 -1.999821 1.439004
H  -5.250678 -0.926833 0.11414
