program: Gaussian 09
title: 000280993
version: EM64L-G09RevD.01
frameworkgroup: C1[X(C8H7F2NO2)]
method: RPBEPBE
basis: SDD
operation: Freq
keyword: #p
keyword: freq=noraman
keyword: PBEPBE/SDD
title: #p freq=noraman PBEPBE/SDD
converged: YES YES NO NO
title: Mulliken charges:
elementType: F F O O N C C C C C C C C H H H H H H H
charge: -0.218884 -0.210578 -0.448404 -0.257300 -0.393634 0.109461 0.335887 0.259297 0.301295 -0.477812 -0.532357 -0.601106 0.110002 0.299460 0.294662 0.330656 0.248318 0.216046 0.249710 0.385281
chargesum: 0.00000
title: Mulliken charges with hydrogens summed into heavy atoms:
elementType: F F O O N C C C C C C C C
charge: -0.218884 -0.210578 -0.063123 -0.257300 -0.062978 0.109461 0.335887 0.259297 0.301295 -0.178352 -0.237694 0.112967 0.110002
polarizability: 1.86294327e+02 4.15228495e+00 1.03651918e+02 3.75936344e-02 -1.87464808e-02 4.58549998e+01
1716.lowfreq: -6.0437 -0.0004 0.0008 0.0013 8.1251 8.5193 45.8862 70.4082 96.1147
frequency: 45.8433 70.4072 96.0810 135.0243 148.2280 165.6276 212.0240 257.8280 289.8807 306.5395 321.8543 372.4226 409.9417 481.7579 517.2055 522.9833 536.5089 539.0468 600.6085 603.1174 621.4592 715.5943 728.0961 742.2578 888.3478 901.4432 903.4830 951.0298 1034.6607 1058.8730 1102.8901 1121.4564 1149.3363 1207.5596 1219.7387 1297.3904 1347.6510 1388.3406 1449.4222 1459.6622 1468.6238 1477.7373 1495.1197 1552.6149 1574.4756 1632.4914 1649.9199 2992.0687 3075.6110 3106.5148 3175.7772 3197.2220 3538.6511 3568.0940
redmass: 3.3287 12.2171 1.4843 3.1938 6.3488 3.5816 4.6827 4.8793 13.9101 6.4966 5.8629 7.4659 6.7801 10.2148 1.9931 2.1349 7.3830 1.9405 1.5846 5.0702 4.6222 10.1971 3.9281 4.3400 1.3832 9.4176 1.4839 7.8141 2.9269 3.2653 1.5113 1.2737 1.6624 1.9178 2.2354 2.2071 3.8170 5.5916 1.2621 3.7605 1.0420 1.9196 1.1618 3.7565 4.7931 8.1516 8.7397 1.0343 1.1020 1.1010 1.0926 1.0932 1.0642 1.0765
irintensity: 4.3021 0.8811 0.1185 0.0429 1.0223 0.0149 2.2799 0.5652 1.8199 8.3865 0.3028 1.7149 1.7026 4.6190 53.9353 106.3980 9.1909 8.2420 100.4352 52.0954 16.1820 2.5330 52.6096 14.0765 12.2727 56.2388 30.2741 131.3099 170.5882 41.3357 174.7464 1.1289 24.6257 14.4739 39.4142 45.0196 94.5282 311.0392 23.1143 2.0816 14.3837 15.3208 1.8036 280.3392 36.3783 565.6724 74.5309 76.0056 31.7234 20.0841 3.5717 3.7998 60.8509 100.3624
temp: 298.150 k
press: 1.00000 atm
elementType: 9 9 8 8 7 6 6 6 6 6 6 6 6 1 1 1 1 1 1 1
symmnumber: 1
zpe: 367412.3 jmol-1
zpe.correction: 0.139940 hartree
zpe.thermalcorrener: 0.152240 hartree
zpe.thermalcorrenthalpy: 0.153184 hartree
zpe.thermalcorrgfe: 0.100924 hartree
zpe.sumelectzpe: -712.995353 hartree
zpe.sumelectthermal: -712.983054 hartree
zpe.sumelectthermalent: -712.982109 hartree
zpe.sumelectthermalfe: -713.034369 hartree
dipole: 3.1801 1.7303 0.0098
dipole: 3.6204
quadrupole: -57.4590 -81.3246 -75.0495
quadrupole: -5.4269 0.0240 0.0063
quadrupole: 13.8187 -10.0469 -3.7718 -5.4269 0.0240 0.0063
hfenergy: -713.1352932 hartree
pointgroup: C01 [X(C8H7F2N1O2)]
dipole: 1.2643453 0.6556893 0.0175528 debye
dipolederiv: -0.3459949 -0.3039205 0.0067278 -0.320783 -0.8672129 0.0220445 0.0072669 0.0222535 -0.1391506 -0.4462683 0.3293787 -0.0259747 0.3892835 -0.7377711 0.0407034 -0.0282079 0.0391267 -0.1197448 -0.9194726 0.4725395 -0.0381054 0.7737697 -0.8813889 0.0465887 -0.0514579 0.0362105 -0.4338303 -1.1243846 -0.3055744 -0.0129574 -0.4849695 -0.8764011 0.0079289 -0.0044635 0.014234 -0.3363118 -1.8183314 0.0274428 -0.0493985 -0.2895565 -0.2526624 -0.0174259 -0.0219498 -0.0068348 -0.4629267 1.7858135 0.1493282 0.0505366 0.415454 -0.1977334 0.0289602 0.0364225 0.0198312 0.1154079 -1.2848509 -0.0447576 -0.0405968 -0.0827906 -0.0772388 -0.001108 -0.038366 0.0002376 -0.039957 -0.2792176 0.2111369 -0.0201892 0.7340642 0.9562025 -0.0169686 -0.0444645 -0.0345753 0.0248112 -0.0444849 -0.3295742 0.0124638 -0.9501158 0.7746576 -0.066643 0.041134 -0.0452937 0.014619 0.3452268 0.0096407 0.0149059 0.254586 -0.0441245 0.0059994 0.0036745 -0.0025958 -0.1041801 0.3835093 0.039145 0.015058 -0.1965606 -0.0552705 -0.0089717 0.0252791 -0.0011459 -0.106304 0.608427 -0.1334418 0.0209221 -0.368595 0.3159118 -0.0199357 0.0264114 -0.0114394 0.2728199 2.5471357 -0.0111265 0.0794555 -0.033944 1.3518868 -0.052275 0.0795469 -0.0514914 0.224997 0.1288135 0.0438244 -0.0038023 0.0264386 0.0632413 0.0062696 -0.0028125 0.0069314 0.1822926 0.1323123 -0.0447409 0.0004853 -0.0015518 0.0533685 0.0055348 -0.0013929 0.0040751 0.1771592 0.1799693 0.0514483 -0.0080868 0.170992 0.1762801 0.0131397 -0.0152063 0.0077457 0.3373948 0.0222453 -0.0098609 0.0443695 0.1389369 0.012986 0.0935336 -0.055218 0.0994613 -0.0808037 -0.1371789 -0.0511985 -0.0042359 -0.1350329 0.0219451 0.0036034 0.0004462 0.0059708 0.1255297 0.0281794 -0.0102484 -0.0402478 0.1441146 -0.0074785 -0.0906969 0.0404278 -0.1056069 -0.0529199 0.238552 -0.089441 -0.0013297 -0.1837398 0.2708024 -0.0002813 0.0029299 0.0029055 0.4010974 unknown
polarizability: 186.2653937|2.623285|103.4018722|4.7316302|-2.5333723|46.133979 unknown
InChI: InChI=1S/C8H7F2NO2/c1-11-7-5(9)2-4(8(12)13)3-6(7)10/h2-3,11-12H,1H3
charge 0 multiplicity 1
20 atoms
F  1.22382 2.578962 -0.0155
F  1.590563 -2.246673 0.213376
O  -3.55918 0.987293 -0.105406
O  -3.477891 -1.335306 0.002449
N  2.835494 0.407243 0.136813
C  1.474925 0.18987 0.10046
C  -1.403194 -0.054739 0.013962
C  0.587569 1.310683 0.019653
C  0.805846 -1.071657 0.134433
C  -0.797165 1.231675 -0.02374
C  -0.580465 -1.209001 0.093874
C  3.892952 -0.610029 0.226112
C  -2.866585 -0.236925 -0.026811
H  -1.40734 2.135179 -0.084989
H  -1.037733 -2.202336 0.123454
H  3.117027 1.387407 0.103486
H  3.817268 -1.201115 1.155786
H  4.866101 -0.092404 0.219226
H  3.862105 -1.3092 -0.627411
H  -4.53422 0.794772 -0.12923
