program: Gaussian 09
title: 000281003
version: EM64L-G09RevD.01
frameworkgroup: C1[X(C11H9Br3N2)]
method: RPBEPBE
basis: SDD
operation: Freq
keyword: #p
keyword: freq=noraman
keyword: PBEPBE/SDD
title: #p freq=noraman PBEPBE/SDD
converged: YES YES NO NO
title: Mulliken charges:
elementType: Br Br Br N N C C C C C C C C C C C H H H H H H H H H
charge: 0.096833 0.165635 0.113479 -0.008193 -0.611477 0.372935 0.425474 0.224693 -0.423740 -0.075312 -0.520699 -0.395556 -0.935228 -0.310034 -0.242182 -0.221884 0.316733 0.229660 0.252778 0.242964 0.267774 0.232926 0.236177 0.286518 0.279725
chargesum: 0.00000
title: Mulliken charges with hydrogens summed into heavy atoms:
elementType: Br Br Br N N C C C C C C C C C C C
charge: 0.096833 0.165635 0.113479 -0.008193 -0.045234 0.372935 0.425474 0.224693 -0.107006 -0.075312 -0.038261 -0.152592 -0.935228 -0.042260 -0.009257 0.014293
polarizability: 2.70037711e+02 2.32591778e+01 2.02220693e+02 -1.81980628e+00 -3.03473081e+00 1.24187459e+02
1716.lowfreq: -7.5205 -1.7966 -0.0006 -0.0006 -0.0004 4.7002 31.9175 51.6752 63.7139
frequency: 31.8992 51.6746 63.6907 91.9090 124.1113 131.6668 138.2462 163.1655 167.0026 187.3366 203.6096 226.6064 240.2236 274.9821 316.4475 352.4813 420.9443 454.5389 486.8106 507.6956 519.2579 537.6232 588.4946 607.9150 630.9294 678.9563 684.8978 729.6587 749.1785 773.4654 797.7208 837.9320 884.3097 894.9826 924.9814 965.9638 991.5187 1000.0136 1014.0755 1041.7413 1099.6703 1130.3839 1145.9329 1165.5791 1175.0510 1219.9320 1256.0570 1291.9783 1307.4758 1347.4152 1358.5432 1396.7066 1422.5571 1444.3339 1464.2846 1481.5041 1547.5198 1587.5473 1623.3593 1645.8872 2971.5738 3024.1436 3127.8979 3136.6329 3141.6666 3158.2805 3173.5240 3474.0885 3603.5747
redmass: 8.9562 5.8784 3.8179 16.1654 6.7038 11.7199 4.8198 16.9727 10.1615 4.1957 7.8918 2.1318 2.7753 3.0734 4.3184 4.3732 3.8746 5.1112 3.1111 4.6416 8.9166 4.6327 5.1784 4.4915 1.8562 5.2344 5.1901 5.0270 6.4274 1.3321 3.2379 3.8798 1.5914 4.2092 1.8149 1.3593 1.3784 1.3397 2.1656 5.0156 3.1923 1.8960 1.3187 1.2678 1.4931 2.4140 2.3665 1.3587 2.0477 1.7588 5.4027 1.7647 5.9069 3.1637 1.1239 3.1007 7.3011 6.1807 6.7164 1.0952 1.0612 1.0982 1.0868 1.0914 1.0899 1.0954 1.0995 1.0458 1.0979
irintensity: 0.1324 0.1917 1.2635 1.0191 3.4836 0.5594 2.4442 0.1673 1.9351 1.1615 4.7427 21.4224 17.7417 8.1757 8.0103 3.3925 13.4717 3.9529 6.3334 52.4097 23.8509 48.3716 92.9095 43.9499 127.2807 62.1964 49.7037 18.1184 19.1838 108.4749 2.1906 46.0235 3.0877 13.8574 4.1879 1.0439 25.2849 0.3660 9.1139 11.0266 27.0914 0.8265 2.5544 1.9086 17.0772 1.9087 4.5784 1.9461 4.4908 8.0510 29.3039 3.4506 1.0651 5.6040 5.4746 12.1139 12.5852 11.2900 0.0104 51.0344 26.1320 7.7986 1.3983 3.4406 9.5886 24.5898 22.2310 1.1395 3.5360
temp: 298.150 k
press: 1.00000 atm
elementType: 35 35 35 7 7 6 6 6 6 6 6 6 6 6 6 6 1 1 1 1 1 1 1 1 1
symmnumber: 1
zpe: 457043.8 jmol-1
zpe.correction: 0.174079 hartree
zpe.thermalcorrener: 0.189914 hartree
zpe.thermalcorrenthalpy: 0.190858 hartree
zpe.thermalcorrgfe: 0.128330 hartree
zpe.sumelectzpe: -573.289754 hartree
zpe.sumelectthermal: -573.273919 hartree
zpe.sumelectthermalent: -573.272975 hartree
zpe.sumelectthermalfe: -573.335503 hartree
dipole: -3.0952 3.2479 0.1643
dipole: 4.4896
quadrupole: -107.8219 -105.0742 -123.0441
quadrupole: 4.0469 -0.9758 1.0444
quadrupole: 4.1582 6.9059 -11.0641 4.0469 -0.9758 1.0444
hfenergy: -573.4638327 hartree
pointgroup: C01 [X(C11H9Br3N2)]
dipole: 0.8605641 1.5424946 0.0112154 debye
dipolederiv: -0.4624064 0.0164346 -0.3188856 0.0838581 -0.198562 0.2201593 -0.4417464 0.116688 -0.7455086 -0.0032261 0.1262108 0.0013595 -0.0465262 -0.7715514 -0.0011284 -0.006858 -0.0023833 -0.0538649 -0.5464428 0.0434424 0.3573566 0.1145325 -0.1715611 -0.1752788 0.4233059 -0.1237901 -0.6033509 -0.3378287 0.1476027 0.0201798 0.1444433 -0.2940574 0.0085353 0.0254396 -0.0064498 -0.2507931 -0.5521721 -0.1150171 -0.139118 0.0160757 -0.7275632 0.0390104 -0.1512467 0.0885663 -0.2539499 -0.0735501 -0.3073582 -0.0550516 -0.2104937 -0.0685309 0.0230774 -0.1302331 0.0552098 0.0201044 0.0847937 -0.1152779 -0.0089797 0.2311438 -0.1173383 -0.0022983 0.0144513 -0.0134057 0.0638534 0.0505491 0.0967677 0.0012119 0.1447695 0.0197633 0.0151145 0.0665608 0.0408705 -0.1687587 -0.03714 0.2144588 0.0206726 -0.0428301 0.0322928 0.0228606 0.0232041 0.0032456 -0.1183037 0.1709488 -0.0862706 -0.01497 -0.3745938 -0.0598328 -0.0297663 -0.0332894 -0.02672 0.1227282 0.1564278 0.0223932 0.0498391 -0.0514344 0.5967116 -0.0948142 0.1431407 -0.2074859 0.1800302 -0.1561073 0.084436 0.0067373 0.1047549 0.1077167 0.0279017 0.0033562 0.0335514 -0.1673933 1.170265 -0.151551 -0.0275935 0.0015101 1.2552765 -0.0220285 -0.0184014 -0.0090636 1.4559267 -0.0421029 0.0905102 0.0149577 -0.059942 0.0892747 0.0156474 0.0000731 0.0210211 -0.1369085 0.0813977 0.0870304 0.0112383 0.1005855 0.0544115 0.020381 0.0148642 0.0181161 -0.1381902 -0.0261614 -0.1620011 -0.0113171 -0.1743193 0.0007635 0.0037248 -0.0090767 0.0084299 -0.1572766 0.1291618 -0.098831 -0.0000866 -0.0612051 0.0524755 -0.0178536 0.0139118 -0.0202179 0.1345097 -0.0729917 -0.0704266 -0.0401032 -0.0462451 -0.0506918 0.0012754 -0.0873348 -0.0008587 0.0293204 0.025291 0.0142696 0.0585032 0.0872963 0.0150175 0.004932 0.0770837 0.0015498 -0.058235 0.0612016 0.0077572 -0.0020513 -0.0749533 -0.0929806 -0.022659 -0.0080654 -0.0194728 0.1521757 0.1019041 -0.0504442 -0.0053992 0.0131732 -0.0378166 -0.0148907 -0.002066 -0.0172011 0.1562286 -0.1136878 -0.0701423 -0.0143427 -0.073993 0.0658561 -0.0095891 -0.0138489 -0.0107694 0.1582399 -0.0623953 0.0963172 0.0006076 0.1081848 0.0130725 -0.008397 0.001896 -0.0091067 0.157696 0.1538183 0.1780052 0.1030444 0.0717287 0.1258201 0.0146868 0.067735 0.0508859 0.1983818 0.3004539 0.001684 -0.0078093 -0.0055203 0.1620338 -0.0186026 0.0271443 0.0287905 0.0233383 unknown
polarizability: 277.0124026|-4.079511|195.0237051|3.679703|4.1743872|124.4097547 unknown
InChI: InChI=1S/C11H9Br3N2/c12-11(13,14)10-8(6-15)5-7-3-1-2-4-9(7)16-10/h1-5H,6,15H2
charge 0 multiplicity 1
25 atoms
Br -3.231848 -0.64716 -1.937332
Br -2.100124 -3.158755 -0.198115
Br -3.532956 -0.706325 1.377042
N  0.122083 -1.211058 -0.103267
N  -1.66935 3.366278 -0.298782
C  -0.859735 1.036114 0.052274
C  1.596493 0.748762 0.093242
C  -0.955762 -0.413687 -0.065143
C  0.430953 1.572516 0.122886
C  1.391618 -0.676882 -0.025501
C  -2.048832 2.003424 0.121114
C  2.932848 1.255754 0.173307
C  -2.295085 -1.159783 -0.180834
C  2.518039 -1.558697 -0.064415
C  4.019217 0.377162 0.135993
C  3.811126 -1.036045 0.015903
H  0.505914 2.663606 0.193938
H  -2.904608 1.591046 -0.449416
H  -2.386442 2.058924 1.173981
H  3.091138 2.336672 0.264538
H  2.327713 -2.63231 -0.155755
H  5.04158 0.765764 0.197978
H  4.67648 -1.706926 -0.01232
H  -2.24116 4.10719 0.112417
H  -1.556398 3.478313 -1.310832
