program: Gaussian 09
title: 000280991
version: EM64L-G09RevD.01
frameworkgroup: C1[X(C10H10ClN3O2)]
method: RPBEPBE
basis: SDD
operation: Freq
keyword: #p
keyword: freq=noraman
keyword: PBEPBE/SDD
title: #p freq=noraman PBEPBE/SDD
converged: YES YES NO NO
title: Mulliken charges:
elementType: Cl O O N N N C C C C C C C C C C H H H H H H H H H H
charge: -0.062209 -0.297075 -0.300677 -0.450363 -0.105963 -0.363761 0.321815 0.177927 0.005631 -0.441319 -0.362179 -0.324342 -0.074048 -0.215092 0.298438 -0.497909 0.320400 0.255370 0.254877 0.265046 0.256747 0.375141 0.256880 0.238610 0.238447 0.229608
chargesum: 0.00000
title: Mulliken charges with hydrogens summed into heavy atoms:
elementType: Cl O O N N N C C C C C C C C C C
charge: -0.062209 -0.297075 -0.300677 -0.129963 -0.105963 0.011381 0.321815 0.177927 0.005631 0.068927 -0.097133 -0.067595 -0.074048 0.041788 0.298438 0.208757
polarizability: 2.41890089e+02 -6.66211465e+00 1.36784898e+02 1.99067887e-01 1.38824195e-01 6.51872319e+01
1716.lowfreq: -6.8318 -4.3131 0.0010 0.0014 0.0019 4.9282 18.5449 49.6525 51.5615
frequency: 18.0369 49.6300 51.5614 78.3991 88.9109 126.6099 161.9186 177.4094 186.4986 187.8539 266.1210 267.7867 309.9065 345.9562 358.3017 426.9706 447.8913 553.2856 555.9144 590.0058 607.4649 632.6240 642.5469 666.7819 681.6774 703.1372 713.0640 757.9344 820.4081 835.0531 853.5816 897.8879 906.1766 953.2507 988.2278 995.6451 1009.7724 1049.6336 1118.1041 1119.6599 1145.7994 1151.2868 1201.3451 1208.2844 1211.2198 1220.9823 1254.7854 1263.2754 1318.6827 1388.1124 1394.7790 1427.0708 1446.3623 1452.3105 1458.5612 1468.1900 1481.7326 1487.8774 1536.6779 1589.7737 1631.7182 1658.8705 2953.9852 2985.3976 2999.6668 3098.5424 3142.3575 3163.0579 3171.8417 3182.2508 3507.9051 3594.6254
redmass: 5.8709 4.5487 5.9716 3.6335 1.4863 2.7706 6.5142 5.9049 8.2698 3.2376 4.0408 6.0923 5.0044 6.3884 13.5388 2.8593 4.8012 6.3476 4.5224 2.5005 1.7474 1.7088 6.4000 1.5238 8.1240 11.1228 5.0955 3.3701 1.5586 5.2760 1.4969 6.0926 6.8830 1.3439 6.6600 1.7662 6.7578 2.0461 1.2537 1.5025 5.3197 1.4906 1.7111 2.0050 1.0773 1.9274 1.7923 3.8605 1.8249 3.8365 2.6608 1.2716 3.7913 1.0501 3.8805 1.1098 1.2815 1.6419 4.4592 8.1815 7.7293 9.5620 1.0585 1.1011 1.0299 1.1046 1.1041 1.0888 1.0940 1.0978 1.0786 1.0816
irintensity: 0.0011 1.4213 2.9137 3.5040 0.3496 8.9410 2.0283 9.5579 1.0134 1.7340 3.0165 15.9520 20.9626 1.5034 1.9591 10.7814 17.6194 1.3743 5.6248 2.8829 62.8190 111.2116 3.5173 50.0702 16.8597 21.1756 5.9752 0.6812 55.3338 11.3811 32.1033 36.1612 7.6463 0.7073 8.5347 0.0581 127.8933 30.8912 0.2356 2.5793 152.3772 12.9160 8.1632 49.8337 1.5453 40.2786 1.5777 31.8818 5.0026 20.3513 179.6960 0.1871 111.3480 12.6380 69.6459 90.3583 172.2860 326.7686 21.8109 15.0828 73.7968 311.0095 28.7788 17.6919 50.6902 33.0072 18.4409 0.7805 0.7535 3.3462 153.4678 53.2932
temp: 298.150 k
press: 1.00000 atm
elementType: 17 8 8 7 7 7 6 6 6 6 6 6 6 6 6 6 1 1 1 1 1 1 1 1 1 1
symmnumber: 1
zpe: 504817.7 jmol-1
zpe.correction: 0.192275 hartree
zpe.thermalcorrener: 0.207170 hartree
zpe.thermalcorrenthalpy: 0.208114 hartree
zpe.thermalcorrgfe: 0.147844 hartree
zpe.sumelectzpe: -1160.692751 hartree
zpe.sumelectthermal: -1160.677856 hartree
zpe.sumelectthermalent: -1160.676912 hartree
zpe.sumelectthermalfe: -1160.737181 hartree
dipole: -0.2540 -1.3548 -0.0095
dipole: 1.3784
quadrupole: -111.2374 -89.2664 -102.0899
quadrupole: 9.2800 -0.0763 0.0319
quadrupole: -10.3729 11.5982 -1.2253 9.2800 -0.0763 0.0319
hfenergy: -1160.8850257 hartree
pointgroup: C01 [X(C10H10Cl1N3O2)]
dipole: -0.0626806 -0.5214446 -0.1351305 debye
dipolederiv: -0.8829196 -0.0953271 -0.0535625 -0.180914 -0.1496017 -0.0262564 -0.0754109 -0.023165 -0.0805127 -1.2591796 -0.3674122 -0.1175306 -0.8538868 -0.960916 -0.179306 -0.2335574 -0.164003 -0.3752812 -0.9962679 0.1579056 0.0190535 0.243812 -0.8689481 -0.1143848 0.0413168 -0.1172487 -0.3940524 -0.7722653 -0.0625738 -0.0334732 0.1320134 -0.4862756 -0.0497821 0.0154112 -0.0560522 -0.2836247 -0.6905583 0.1403595 0.020242 0.1550033 -0.5053501 -0.0601589 0.0229087 -0.0602849 -0.2599416 -1.7638897 -0.1412374 -0.0742059 0.0737802 -0.4164008 0.0120264 -0.0210526 0.0043365 -0.4514191 0.2604692 -0.1862493 -0.0403222 -0.4947133 0.1388118 -0.001582 -0.1187002 0.0091306 0.0730011 0.6656701 0.1502598 0.0610672 -0.0009383 0.6396372 0.1532244 0.0283315 0.1571658 0.0752249 0.4006123 -0.1330669 -0.0196013 0.1380456 -0.0852076 -0.0182589 0.0494226 -0.0280845 0.0021169 0.3427227 0.13472 0.0308005 0.513116 0.3292545 0.0070294 0.1183442 -0.0031211 0.3636991 -0.2340735 0.0456817 0.0086143 -0.0125614 -0.0664461 0.0207147 -0.0062719 0.0229157 -0.1445943 0.1809812 0.0184765 0.0160962 -0.0940771 0.1080716 0.0568588 -0.0120246 0.0607837 -0.114857 1.1718339 0.1593289 0.0855471 0.3967422 0.2301315 0.0904228 0.1458433 0.0817595 -0.0437641 -0.4284419 -0.0966238 -0.0349983 -0.2198505 -0.0638322 0.0109949 -0.0662837 0.0155288 -0.1374928 2.521411 0.1311739 0.0977671 0.3732686 1.4806885 0.29029 0.1533252 0.2831026 0.4039256 0.8073379 0.2033977 0.0655887 0.0922779 0.263557 -0.0038614 0.0376295 -0.000976 0.2915028 0.1875036 -0.0082938 -0.0081257 -0.0158854 0.2090076 -0.036423 -0.0098422 -0.0365748 0.3402241 -0.0518376 0.0099225 -0.0100339 -0.1027215 -0.0590752 0.0690217 -0.0238655 0.1001774 0.0080564 -0.0479284 0.0104022 0.0136382 -0.0962746 0.0249114 -0.0674906 -0.0241065 -0.0915009 -0.0741475 0.0714161 -0.0209858 -0.0096509 -0.0370037 -0.0043796 -0.0505346 -0.0137369 -0.0499711 0.1766768 0.0747813 -0.053142 -0.0167829 -0.0239504 -0.0176619 -0.0473792 -0.0094352 -0.0483444 0.1534254 0.4929006 0.0239509 0.0117625 -0.0966013 0.1919451 -0.0361367 -0.0180013 -0.0327108 0.3202772 0.0117246 0.0767223 0.0136294 0.0647401 0.0423469 -0.0303893 0.0104959 -0.0299619 0.1644352 -0.054957 -0.0369226 0.0331695 0.0584819 0.100106 -0.0548008 0.1027327 -0.0232475 -0.0924732 -0.0484303 -0.021607 -0.0468602 0.0927974 0.0276827 0.1227737 -0.0658441 0.0849979 -0.0281494 0.0413846 -0.03886 -0.0118285 -0.1047003 -0.1020568 -0.0566121 -0.0276284 -0.054652 0.1077445 unknown
polarizability: 242.1090545|-0.7939787|132.1823594|5.8979482|16.7225051|69.5708048 unknown
InChI: InChI=1S/C10H10ClN3O2/c1-16-10(15)12-5-9-13-7-3-2-6(11)4-8(7)14-9/h2-4,12,14H,5H2,1H3
charge 0 multiplicity 1
26 atoms
Cl -6.01539 -0.571712 -0.291091
O  4.49177 1.225714 0.505699
O  4.588239 -1.068826 -0.048641
N  -0.76133 -1.569612 -0.351247
N  -0.133014 0.548754 0.207469
N  2.558726 0.074796 0.170597
C  -1.957402 -0.847065 -0.212247
C  0.294172 -0.687691 -0.089099
C  -1.544086 0.484006 0.139594
C  1.742071 -1.094589 -0.137255
C  -3.310593 -1.212806 -0.354517
C  -2.512913 1.487521 0.358284
C  -4.239414 -0.181336 -0.127303
C  -3.874155 1.145053 0.221959
C  3.925053 -0.021475 0.186599
C  5.967646 1.234194 0.551342
H  -0.673926 -2.553905 -0.598594
H  1.942798 -1.912456 0.586088
H  2.002455 -1.500127 -1.137218
H  -3.636031 -2.221182 -0.621923
H  -2.211471 2.503795 0.626465
H  2.071485 0.954126 0.370842
H  -4.654155 1.893999 0.383207
H  6.387758 0.94949 -0.428401
H  6.336169 0.531986 1.318525
H  6.232538 2.270147 0.806864
