program: Gaussian 09
title: 000281040
version: EM64L-G09RevD.01
frameworkgroup: C1[X(C21H24N4O3)]
method: RPBEPBE
basis: SDD
operation: Freq
keyword: #p
keyword: freq=noraman
keyword: PBEPBE/SDD
title: #p freq=noraman PBEPBE/SDD
converged: YES YES NO NO
title: Mulliken charges:
elementType: O O O N N N N C C C C C C C C C C C C C C C C C C C C C H H H H H H H H H H H H H H H H H H H H H H H H
charge: -0.237150 -0.252343 -0.264089 -0.164520 -0.297655 -0.035175 0.021961 0.266780 -0.570096 -0.361089 -0.363383 0.410960 0.569728 -0.336015 -0.323929 -0.334978 -0.392107 0.280874 -0.391154 -0.412274 -0.252550 -0.248590 -0.243868 -0.232078 -0.230816 -0.239709 -0.250633 -0.668358 0.278961 0.246627 0.251736 0.253696 0.222554 0.185578 0.220847 0.184658 0.219877 0.229464 0.266523 0.247604 0.222685 0.225409 0.225280 0.228562 0.226289 0.226163 0.228750 0.233321 0.229270 0.229593 0.249435 0.219374
chargesum: 0.00000
title: Mulliken charges with hydrogens summed into heavy atoms:
elementType: O O O N N N N C C C C C C C C C C C C C C C C C C C C C
charge: -0.237150 -0.252343 -0.264089 -0.164520 -0.297655 -0.035175 0.021961 0.266780 -0.291135 0.137274 0.112866 0.410960 0.569728 0.070410 0.080606 -0.105513 -0.125584 0.280874 -0.143550 -0.189590 -0.027141 -0.023309 -0.015306 -0.005789 -0.004652 -0.010959 0.211958 0.030044
polarizability: 2.78005122e+02 -3.41280403e+00 2.61804680e+02 1.32277787e+01 -4.95958405e+00 2.24656090e+02
1716.lowfreq: -4.7138 -0.0005 0.0001 0.0005 2.5421 4.5770 21.9557 28.8324 42.6871
frequency: 21.4320 28.7166 42.6051 47.6083 50.1457 58.3729 67.2687 78.6920 89.9020 100.3357 121.4228 137.0588 156.8119 181.4001 206.9556 225.6509 227.4450 236.6996 247.6678 257.4557 273.4842 286.6509 315.3471 327.5464 343.6499 372.0119 402.7290 403.8611 412.8945 426.5465 447.9835 459.8952 468.3549 510.8198 516.7170 531.3273 569.2318 615.3735 617.6921 642.2541 649.6408 662.6970 698.1458 701.3002 709.2787 721.0204 747.4301 759.9950 764.7354 792.5355 810.2297 814.4082 825.8008 833.5027 849.5971 856.0036 862.5488 871.3548 895.3951 924.7096 926.2280 937.7824 950.7810 975.1273 982.4179 989.1365 991.2280 992.8361 993.6241 996.5761 1002.3486 1021.2539 1024.8075 1032.0407 1035.5977 1050.5258 1072.5232 1082.1860 1086.5063 1088.8014 1094.3463 1094.9038 1124.7910 1148.1079 1156.3936 1173.0267 1174.1810 1189.7172 1195.5568 1196.2723 1199.6610 1212.7564 1230.2255 1263.8147 1274.6497 1279.1578 1286.7589 1292.3135 1315.8937 1318.3287 1337.8114 1346.2209 1349.7329 1361.7704 1369.6735 1373.7649 1380.9223 1385.4266 1388.0927 1407.3894 1436.7767 1440.5021 1444.0664 1447.0978 1452.4192 1457.1926 1464.0976 1465.4586 1483.4450 1485.5907 1486.1371 1592.5409 1596.1518 1606.2267 1613.8289 1615.7501 2917.8909 2942.6914 2948.0975 2977.2156 2992.5659 3031.9889 3057.7968 3063.9687 3080.1861 3084.0652 3088.2379 3095.0412 3098.0783 3118.9093 3121.6746 3123.7753 3127.0539 3132.0921 3138.8606 3144.2674 3149.5435 3154.5536 3164.8383 3167.2979
redmass: 4.7615 4.4665 3.9458 3.2610 4.7623 4.6542 3.7727 4.8214 3.8176 3.8881 7.0643 3.8372 6.2742 5.2663 2.9752 2.3814 3.7168 2.0938 4.4172 3.6221 3.9719 3.6323 2.9565 3.6277 3.6815 4.3399 2.6953 2.7888 2.9511 2.8068 5.1632 3.4139 5.5406 4.0396 4.3951 4.1781 3.3606 6.3444 6.2784 6.2137 4.5901 3.6736 4.9016 2.1869 2.0448 3.2757 3.1001 2.0009 2.8150 3.8932 1.3729 3.9748 4.1854 1.7330 1.2679 4.6827 1.2895 3.7711 3.0027 1.5621 3.5027 1.5610 5.9287 1.3983 3.1337 1.5860 4.3465 4.9428 1.7643 1.6110 1.6142 2.7901 2.8033 2.1581 2.2938 1.9386 4.4937 2.9972 2.7044 1.6347 2.1352 2.1221 2.6868 4.6522 1.6833 1.0548 1.0535 1.1643 1.1381 1.1291 1.3369 2.5664 1.9904 1.3946 1.2799 1.1376 1.5828 3.9783 1.4615 1.3479 1.2320 1.3268 1.3044 1.4045 1.3837 1.4596 5.3971 5.0391 1.2412 5.6949 2.1731 1.0858 1.7222 1.0981 1.2347 1.1053 1.0466 1.1235 2.2789 1.0603 2.2179 6.2591 5.9991 9.0749 6.0486 6.2352 1.0701 1.0680 1.0677 1.0676 1.0359 1.0601 1.0859 1.0895 1.0950 1.0969 1.0973 1.1026 1.0929 1.0868 1.1065 1.0848 1.0865 1.0877 1.0917 1.0927 1.0961 1.0955 1.1015 1.1006
irintensity: 0.2250 0.6908 0.2446 0.1482 0.1997 0.3764 0.0914 0.5076 0.6501 0.4459 0.2988 2.5406 3.2062 1.5932 9.3600 3.8647 1.4134 0.7344 0.7856 1.3867 5.1549 3.0710 14.0898 6.8935 5.5132 4.2829 1.4894 0.9439 0.2174 6.6169 2.3504 2.9030 5.8931 14.1643 14.9618 8.7564 1.6447 0.0483 0.5189 6.6928 7.7787 6.3599 28.9362 49.0453 14.0519 31.0475 41.7586 45.4982 22.8577 24.0950 7.1522 58.1791 15.1940 3.6133 2.2804 35.7852 2.7555 33.6293 44.5906 7.0083 68.0564 9.7186 107.5101 0.3401 0.9471 7.4802 3.0529 1.2450 19.8704 16.4040 15.6402 38.7277 47.5585 13.7332 45.7899 13.9519 108.9479 42.1666 89.1410 8.1909 1.0326 22.4635 82.4309 18.0052 46.6382 0.3402 0.0393 5.5323 1.8638 1.2157 20.8857 10.5177 20.4031 19.0388 8.1846 30.3976 43.5151 465.7733 24.4583 9.7947 5.4694 0.9811 2.6960 54.5195 6.0010 10.8425 1.5842 8.9003 21.7390 53.0289 16.5925 2.4779 9.2304 15.4872 5.9532 28.5448 15.4328 11.9182 13.4052 20.4243 11.7971 1.5250 1.0305 194.1549 0.8378 22.6476 38.5865 31.9214 90.7601 35.3830 18.2687 32.9758 3.7850 20.3328 34.8946 33.2468 40.7255 1.3684 10.5899 5.1088 30.6218 0.8707 0.2814 1.8534 15.0384 20.8671 19.3923 39.2257 19.3348 16.3337
temp: 298.150 k
press: 1.00000 atm
elementType: 8 8 8 7 7 7 7 6 6 6 6 6 6 6 6 6 6 6 6 6 6 6 6 6 6 6 6 6 1 1 1 1 1 1 1 1 1 1 1 1 1 1 1 1 1 1 1 1 1 1 1 1
symmnumber: 1
zpe: 1097216.7 jmol-1
zpe.correction: 0.417908 hartree
zpe.thermalcorrener: 0.443080 hartree
zpe.thermalcorrenthalpy: 0.444024 hartree
zpe.thermalcorrgfe: 0.361673 hartree
zpe.sumelectzpe: -1257.183200 hartree
zpe.sumelectthermal: -1257.158028 hartree
zpe.sumelectthermalent: -1257.157084 hartree
zpe.sumelectthermalfe: -1257.239435 hartree
dipole: 2.1311 0.6428 2.3465
dipole: 3.2343
quadrupole: -158.3099 -147.9787 -172.1379
quadrupole: -11.2305 5.8662 2.9785
quadrupole: 1.1656 11.4968 -12.6624 -11.2305 5.8662 2.9785
hfenergy: -1257.6011079 hartree
pointgroup: C01 [X(C21H24N4O3)]
dipole: 0.7426897 0.9705647 0.3544005 debye
polarizability: 278.5876489|10.5159796|242.6281553|9.5055051|-18.2941081|243.2500874 unknown
InChI: InChI=1S/C21H24N4O3/c1-2-28-20(26)25-21(18-11-7-4-8-12-18,24-13-15-27-16-14-24)19(22-23-25)17-9-5-3-6-10-17/h3-12,19H,2,13-16H2,1H3
charge 0 multiplicity 1
52 atoms
O  -2.616203 -3.342016 2.791423
O  -3.05527 0.721897 -2.01627
O  -2.7172 1.140406 0.267365
N  -0.926363 -1.629457 1.142417
N  -1.275337 -0.267291 -0.936475
N  -0.054884 -1.823424 -2.006635
N  -1.12297 -1.104544 -2.100943
C  -0.308867 -0.696351 0.183664
C  0.720883 -1.496118 -0.744333
C  -1.842571 -1.064691 2.184013
C  -1.539854 -2.869997 0.586986
C  0.362525 0.486895 0.886764
C  2.022968 -0.799926 -1.124868
C  -2.019125 -2.096337 3.305866
C  -1.768488 -3.885895 1.72299
C  0.420428 1.772247 0.30067
C  1.039389 0.263562 2.112493
C  -2.389057 0.575288 -0.8070
C  2.092085 0.100338 -2.216678
C  3.198161 -1.075764 -0.383767
C  1.115025 2.821134 0.939712
C  1.733389 1.311308 2.753194
C  1.771376 2.59888 2.170985
C  3.313973 0.723566 -2.550584
C  4.419115 -0.448668 -0.712719
C  4.480573 0.454939 -1.798279
C  -4.251748 1.622248 -1.979703
C  -3.838129 3.085881 -2.149687
H  0.969921 -2.443618 -0.237222
H  -2.834422 -0.82033 1.751485
H  -1.42369 -0.130473 2.587074
H  -0.883834 -3.33592 -0.167386
H  -2.51117 -2.645319 0.088675
H  -1.036724 -2.318951 3.777609
H  -2.72284 -1.728608 4.070664
H  -0.784733 -4.191066 2.143334
H  -2.300876 -4.775009 1.346206
H  -0.071813 1.960577 -0.658528
H  1.015217 -0.737071 2.557873
H  1.200035 0.298377 -2.82088
H  3.156274 -1.779918 0.456352
H  1.144728 3.811986 0.473335
H  2.247265 1.121092 3.70217
H  2.308583 3.415117 2.666604
H  3.357445 1.413292 -3.400879
H  5.319871 -0.667679 -0.128706
H  5.428607 0.938092 -2.059834
H  -4.786808 1.462515 -1.027208
H  -4.858579 1.259894 -2.824303
H  -3.246317 3.222115 -3.071221
H  -3.246342 3.428309 -1.284233
H  -4.740822 3.720689 -2.222681
