program: Gaussian 09
title: 000281026
version: EM64L-G09RevD.01
frameworkgroup: C1[X(C24H23ClO2)]
method: RPBEPBE
basis: SDD
operation: Freq
keyword: #p
keyword: freq=noraman
keyword: PBEPBE/SDD
title: #p freq=noraman PBEPBE/SDD
converged: YES YES NO NO
title: Mulliken charges:
elementType: Cl O O C C C C C C C C C C C C C C C C C C C C C C C C H H H H H H H H H H H H H H H H H H H H H H H
charge: -0.051788 -0.270336 -0.252750 -0.127693 -0.662165 0.466042 0.570517 0.014364 0.358027 0.384727 0.136420 0.498524 -0.374865 -0.431875 -0.620218 -0.616445 -0.442906 -0.337111 -0.821634 -0.811665 -0.235573 -0.229442 -0.814160 -0.221080 -0.231086 -0.238844 -0.239621 0.265544 0.334533 0.271287 0.241525 0.239941 0.238561 0.246458 0.267186 0.262919 0.230836 0.222519 0.225653 0.221000 0.268204 0.228560 0.228333 0.238494 0.226483 0.226908 0.228959 0.229133 0.229266 0.230339
chargesum: 0.00000
title: Mulliken charges with hydrogens summed into heavy atoms:
elementType: Cl O O C C C C C C C C C C C C C C C C C C C C C C C C
charge: -0.051788 -0.270336 -0.252750 0.137851 -0.327632 0.466042 0.570517 0.014364 0.358027 0.384727 0.136420 0.498524 -0.103578 -0.190350 -0.380277 -0.377884 -0.196448 -0.069924 -0.105361 -0.096809 -0.007013 -0.001109 -0.122275 0.007878 -0.001953 -0.009579 -0.009282
polarizability: 3.55909183e+02 7.28696111e+00 2.78999333e+02 -3.70919033e+01 2.19325436e+01 1.86885316e+02
1716.lowfreq: -15.3119 -7.5469 -4.9400 -0.0025 -0.0015 -0.0013 9.7668 14.2309 15.5377
frequency: 9.2006 13.8074 14.7030 22.0492 25.6723 39.6771 54.6395 59.8562 69.4348 88.0555 105.3702 132.9982 146.4863 157.0676 167.1870 175.8021 192.4075 199.0394 218.4670 229.3489 236.6648 269.6270 293.9976 298.3582 313.1072 327.1537 371.9745 402.2734 405.7052 415.7235 477.1815 500.4741 508.5999 526.2499 527.8133 553.3840 558.0537 571.8631 593.3708 604.9525 614.6859 619.2267 628.8412 695.1055 700.1758 702.1910 707.5346 749.5594 769.6633 773.0360 793.9805 834.4226 853.6786 854.5775 858.5248 869.0233 899.1336 906.8802 923.5294 935.4724 941.3292 956.9403 979.5233 980.4826 987.9014 990.2803 994.8465 998.1314 1001.0903 1016.3682 1018.5383 1021.6185 1027.4779 1031.3176 1041.8349 1046.4034 1047.6129 1052.2209 1082.2647 1084.2763 1167.1353 1173.3460 1173.5464 1189.4298 1190.7521 1202.5489 1204.4952 1207.3509 1227.7344 1256.6621 1259.5535 1305.4112 1313.1936 1317.0364 1332.4126 1350.2729 1359.3558 1384.2717 1386.3916 1396.1104 1399.3910 1402.4455 1414.8846 1436.4986 1439.7672 1440.9240 1461.7404 1464.9236 1471.3616 1473.2013 1479.2179 1481.8392 1485.6492 1488.6654 1572.0362 1590.9499 1592.1660 1602.0846 1611.2483 1615.4267 1617.3996 2975.6861 2987.9434 2991.0707 2997.6627 3057.4452 3071.1883 3077.3687 3087.0109 3088.2650 3092.8740 3094.1400 3119.7189 3121.4355 3122.1228 3123.6213 3129.5803 3130.1622 3143.0163 3143.5944 3155.7851 3159.6449 3167.6059 3173.5410
redmass: 2.9731 2.2460 1.7103 4.3304 4.3157 4.3926 4.6084 4.9683 6.2415 7.4371 5.5788 1.7176 1.5008 1.3667 3.7279 3.3562 7.3691 4.6824 2.7889 4.8224 4.6339 2.8341 4.7557 6.0459 6.8222 3.1151 5.4535 2.8373 2.8255 4.4930 4.4456 3.4269 3.8858 4.7885 3.0534 4.5367 4.4019 4.6584 4.4954 5.0971 6.0276 5.7170 5.8652 4.6869 3.4709 1.9371 1.8653 2.3577 2.9953 3.1769 3.0948 5.0449 1.8112 1.3250 1.8269 1.3022 1.3047 3.3354 1.5054 1.8786 2.2951 3.5058 1.3910 1.3898 4.7544 5.4448 2.5908 1.3354 1.8189 3.4919 2.1110 1.6461 2.1868 2.0770 1.5627 1.5522 1.7562 1.6787 1.6154 1.6040 2.1315 1.0562 1.0587 1.1167 1.1219 1.6187 1.6070 1.4920 2.2627 1.6309 1.5650 1.2648 5.7334 1.5642 1.2736 1.5659 7.1708 7.7981 5.8325 1.2304 1.3614 1.2354 2.0529 2.0002 2.1597 2.1303 1.0607 1.0982 1.1040 1.0578 1.1683 2.2796 2.3467 1.3683 7.4087 6.2913 6.2764 8.9753 6.0767 6.0893 5.8281 1.0388 1.0375 1.0366 1.0831 1.0946 1.0960 1.0970 1.0999 1.1003 1.0861 1.1002 1.0911 1.0862 1.0864 1.0920 1.0881 1.0876 1.0923 1.0933 1.0960 1.0980 1.1011 1.0978
irintensity: 0.6865 0.3796 0.3020 0.6481 0.1582 0.1498 0.1612 0.0868 1.0036 1.1231 2.3094 1.2352 0.0481 2.4817 2.1155 4.3574 1.5559 0.4373 0.0944 0.0752 1.2770 1.8555 11.3396 2.9346 2.4789 0.6448 1.3275 0.9931 0.5339 1.3966 7.7059 0.9091 5.1908 1.2729 2.7415 15.9512 3.3988 2.6845 51.5041 4.2009 2.3668 11.6766 7.1467 16.7987 1.4614 55.4697 87.2038 18.6328 24.3255 9.1591 20.4606 16.8449 8.3153 1.3927 6.0242 18.7473 0.2961 33.9075 0.8608 2.5880 12.0819 20.9281 0.1582 0.0199 4.1571 0.0485 5.9161 0.2729 6.9222 307.5953 111.9594 22.7475 4.4552 1.3761 2.9737 8.6000 27.3775 35.4609 13.0492 4.3549 128.4185 0.0424 0.3588 2.1200 0.2520 13.2390 4.5788 10.1896 211.0164 2.1368 32.8644 17.1126 9.5140 3.4034 3.7604 4.8822 2.4891 0.3119 0.9195 15.8096 20.2589 10.1062 7.0455 70.3413 16.6384 0.7930 25.7410 1.1027 14.9331 10.3590 38.9517 10.1219 7.8244 15.6067 35.7494 23.5698 18.1495 145.4463 1.5560 2.5683 86.2810 33.6477 24.1797 17.1666 7.7198 21.5701 19.9550 13.4893 14.7304 24.2281 1.6782 18.2891 26.3759 3.5027 3.7891 18.8788 2.6914 1.5016 21.2186 26.0600 27.3283 31.4018 17.1555 5.1842
temp: 298.150 k
press: 1.00000 atm
elementType: 17 8 8 6 6 6 6 6 6 6 6 6 6 6 6 6 6 6 6 6 6 6 6 6 6 6 6 1 1 1 1 1 1 1 1 1 1 1 1 1 1 1 1 1 1 1 1 1 1 1
symmnumber: 1
zpe: 1046833.0 jmol-1
zpe.correction: 0.398718 hartree
zpe.thermalcorrener: 0.424857 hartree
zpe.thermalcorrenthalpy: 0.425802 hartree
zpe.thermalcorrgfe: 0.336557 hartree
zpe.sumelectzpe: -1536.965080 hartree
zpe.sumelectthermal: -1536.938941 hartree
zpe.sumelectthermalent: -1536.937996 hartree
zpe.sumelectthermalfe: -1537.027241 hartree
dipole: -0.0583 1.4326 -0.9356
dipole: 1.7120
quadrupole: -135.3480 -153.5280 -171.0281
quadrupole: 1.0147 -9.8644 2.6278
quadrupole: 17.9533 -0.2267 -17.7267 1.0147 -9.8644 2.6278
hfenergy: -1537.3637979 hartree
pointgroup: C01 [X(C24H23Cl1O2)]
dipole: 0.0435946 -0.4306194 -0.5160854 debye
polarizability: 355.2063102|-1.4724533|283.2191553|39.3117368|8.7822221|183.3683671 unknown
InChI: InChI=1S/C24H23ClO2/c1-16-14-17(2)21(18(3)15-16)24(26)27-23(20-12-8-5-9-13-20)22(25)19-10-6-4-7-11-19/h4-15,22-23H,1-3H3
charge 0 multiplicity 1
50 atoms
Cl -1.245968 -0.097541 2.558671
O  0.573675 -0.219575 -0.028459
O  0.92047 1.989478 -0.671137
C  -0.890075 -0.039007 -0.272372
C  -1.509871 0.789585 0.891782
C  -1.470153 -1.414744 -0.538251
C  -2.969849 1.133224 0.679179
C  2.843934 0.575546 -0.088174
C  3.646325 1.550218 0.588859
C  3.429474 -0.635687 -0.577608
C  1.399421 0.883173 -0.307312
C  5.623101 0.085752 0.321165
C  -1.069024 -2.541579 0.223309
C  -2.427308 -1.579432 -1.569182
C  5.018682 1.277543 0.787676
C  4.812785 -0.846656 -0.368493
C  -3.290347 2.423125 0.182299
C  -4.013639 0.205234 0.920889
C  3.071749 2.853231 1.119358
C  2.645995 -1.688365 -1.345572
C  -1.630655 -3.810497 -0.038144
C  -2.991608 -2.848647 -1.828041
C  7.094659 -0.190876 0.568444
C  -4.633307 2.775915 -0.081621
C  -5.354673 0.561365 0.665004
C  -2.595223 -3.968299 -1.061334
C  -5.669509 1.845388 0.160144
H  -1.00688 0.609981 -1.163974
H  -0.91222 1.706587 1.000112
H  -0.319825 -2.416446 1.010039
H  -2.736985 -0.714124 -2.167503
H  5.630489 2.0172 1.318715
H  5.268432 -1.765296 -0.75841
H  -2.488392 3.149591 0.002482
H  -3.772082 -0.782656 1.32571
H  2.723123 3.500826 0.29673
H  2.19665 2.680746 1.773042
H  3.830903 3.399236 1.704327
H  2.008995 -1.243527 -2.130559
H  3.334533 -2.402884 -1.828311
H  1.968969 -2.250451 -0.679709
H  -1.315663 -4.676242 0.555113
H  -3.732455 -2.962544 -2.627086
H  7.240386 -0.711419 1.535206
H  7.524359 -0.835086 -0.218473
H  7.682085 0.743182 0.608143
H  -4.869144 3.77526 -0.463754
H  -6.154999 -0.160568 0.861927
H  -3.028448 -4.954538 -1.262851
H  -6.712288 2.120201 -0.034499
