program: Gaussian 09
title: 000025276
version: EM64L-G09RevD.01
frameworkgroup: C1[X(C11H19NSi)]
method: RPBEPBE
basis: SDD
operation: Freq
keyword: #p
keyword: freq=noraman
keyword: PBEPBE/SDD
title: #p freq=noraman PBEPBE/SDD
converged: YES YES NO NO
title: Mulliken charges:
elementType: Si N C C C C C C C C C C C H H H H H H H H H H H H H H H H H H H
charge: 1.387204 -0.775638 -0.350132 -1.049440 -1.014666 -1.023635 -0.547139 0.504569 -0.405438 -0.413986 -0.227132 -0.225422 -0.244627 0.288999 0.208218 0.226424 0.240568 0.238135 0.238686 0.227028 0.233736 0.236482 0.231395 0.236129 0.230910 0.218716 0.199575 0.228812 0.230939 0.222199 0.222428 0.226100
chargesum: 0.00000
title: Mulliken charges with hydrogens summed into heavy atoms:
elementType: Si N C C C C C C C C C C C
charge: 1.387204 -0.486639 0.084510 -0.332051 -0.317419 -0.325200 -0.128847 0.504569 -0.176626 -0.183047 -0.004933 -0.002994 -0.018527
polarizability: 1.92242953e+02 -4.40869585e+00 1.43094161e+02 -1.39997704e+01 -2.27958325e+00 1.08313814e+02
1716.lowfreq: -15.3659 -9.8393 -5.8127 -0.0017 -0.0007 -0.0006 13.0028 22.0532 34.7997
frequency: 4.5210 21.4229 34.7929 47.9252 88.6374 102.5584 134.2191 140.7748 149.8120 167.1087 189.7533 211.6658 240.2144 258.3736 316.2221 335.5444 375.7301 403.7266 406.0342 503.3349 563.6011 591.4326 617.6607 679.1390 696.0251 704.8535 721.1137 732.3116 757.7020 779.5690 803.6712 814.7387 828.4843 854.0192 899.1353 900.9231 912.3102 927.8412 974.8044 989.4397 991.0720 1001.7865 1011.1640 1026.0333 1088.3384 1120.9179 1153.8464 1171.2358 1185.6519 1214.4334 1264.1292 1281.8470 1289.0000 1292.5680 1303.8785 1325.2035 1342.0171 1381.0551 1401.4665 1438.4033 1439.3583 1443.5831 1446.8942 1451.2856 1454.8761 1461.8756 1468.5381 1481.6297 1482.3646 1591.1550 1613.1060 2943.9970 2975.3452 2977.3532 2982.7112 2983.7082 3011.5950 3052.8161 3074.4955 3078.2573 3084.6412 3085.5032 3087.3134 3088.5448 3112.4537 3112.5095 3129.5858 3141.2210 3160.4647 3542.5606
redmass: 3.0464 3.5052 3.6246 2.9803 3.5127 1.0631 1.0688 1.4756 1.4428 2.3134 2.5963 2.5336 3.0204 3.4140 2.2104 2.4244 2.1665 2.5458 2.0853 3.1949 4.1077 4.3375 6.3651 3.0239 3.0183 1.8551 2.2029 1.1923 1.9967 1.2509 1.3456 1.9985 2.1147 1.2474 1.5382 1.5437 1.4799 1.7095 1.3863 6.0737 1.4684 3.4209 1.6612 2.1845 1.5102 5.0042 1.1272 1.0512 1.1131 2.3782 1.3979 1.2040 1.2101 1.2078 1.1949 1.2596 1.2156 7.5945 1.2931 1.1158 1.9604 1.0567 1.0540 1.0521 1.0491 1.0479 1.0981 1.0887 2.3247 6.0408 6.1742 1.0641 1.0343 1.0342 1.0345 1.0619 1.0949 1.1040 1.0978 1.0975 1.0983 1.0987 1.0982 1.0979 1.0862 1.0875 1.0906 1.0958 1.1014 1.0749
irintensity: 0.0054 0.0338 0.0325 0.3332 0.6234 0.0760 0.0802 0.3430 0.6296 0.3058 0.3641 1.7612 4.3864 3.8506 1.9642 0.9836 18.4170 18.4294 70.0206 29.7267 2.4235 3.3033 0.0606 21.8343 10.6239 54.1302 17.2215 0.6354 39.9821 4.2291 15.0636 7.6347 14.2108 0.1794 86.8761 110.5435 6.4347 229.5734 0.0640 0.0841 2.0659 19.5132 3.1763 8.8430 15.8844 214.1453 14.6820 0.2812 0.4161 1.5357 24.1135 1.0137 48.5377 57.1569 22.0655 0.1564 17.2392 0.8009 56.7922 1.1188 6.0041 0.6167 0.6336 7.1591 8.3793 15.7973 1.1623 10.3532 20.3244 1.5001 12.7513 49.2898 15.8193 13.6392 12.0617 42.9985 15.8321 39.3228 7.0258 41.7947 8.0470 6.8866 29.6033 36.8296 12.5319 6.6973 10.7768 48.7866 25.4903 4.4665
temp: 298.150 k
press: 1.00000 atm
elementType: 14 7 6 6 6 6 6 6 6 6 6 6 6 1 1 1 1 1 1 1 1 1 1 1 1 1 1 1 1 1 1 1
symmnumber: 1
zpe: 712525.4 jmol-1
zpe.correction: 0.271387 hartree
zpe.thermalcorrener: 0.288089 hartree
zpe.thermalcorrenthalpy: 0.289033 hartree
zpe.thermalcorrgfe: 0.223298 hartree
zpe.sumelectzpe: -773.739072 hartree
zpe.sumelectthermal: -773.722370 hartree
zpe.sumelectthermalent: -773.721425 hartree
zpe.sumelectthermalfe: -773.787161 hartree
dipole: 0.5950 -0.4022 -0.1237
dipole: 0.7287
quadrupole: -84.9169 -81.7055 -92.6537
quadrupole: -0.3273 -3.6586 0.3353
quadrupole: 1.5085 4.7199 -6.2284 -0.3273 -3.6586 0.3353
hfenergy: -774.0104588 hartree
pointgroup: C01 [X(C11H19N1Si1)]
dipole: 0.23029 -0.0939795 -0.1426005 debye
polarizability: 191.739853|5.2247762|131.3355374|-14.9885192|16.596155|120.5755384 unknown
InChI: InChI=1S/C11H19NSi/c1-13(2,3)12-10-9-11-7-5-4-6-8-11/h4-8,12H,9-10H2,1-3H3
charge 0 multiplicity 1
32 atoms
Si 3.498451 -0.031715 0.104382
N  2.091206 -0.825527 -0.649887
C  0.716384 -0.798368 -0.136204
C  4.945533 -0.261638 -1.120847
C  3.912785 -0.833463 1.794569
C  3.133428 1.826141 0.396883
C  -0.262431 0.056475 -1.008094
C  -1.665181 0.086762 -0.425671
C  -2.59371 -0.950334 -0.706406
C  -2.061096 1.120365 0.463725
C  -3.878898 -0.955511 -0.118666
C  -3.345043 1.120586 1.054378
C  -4.259464 0.080777 0.765644
H  2.207498 -1.331506 -1.530383
H  0.723626 -0.381466 0.890205
H  0.298059 -1.823918 -0.045809
H  4.730695 0.228727 -2.087911
H  5.874616 0.180943 -0.717241
H  5.141204 -1.333193 -1.311099
H  4.752978 -0.312379 2.291259
H  3.042748 -0.795664 2.476716
H  4.192235 -1.89468 1.663054
H  3.98022 2.322027 0.907643
H  2.955425 2.345952 -0.562085
H  2.236587 1.961675 1.030671
H  0.158807 1.076147 -1.085898
H  -0.274027 -0.372024 -2.029718
H  -2.308198 -1.753166 -1.398331
H  -1.358991 1.934152 0.686313
H  -4.583677 -1.762028 -0.352167
H  -3.634129 1.930829 1.7338
H  -5.256739 0.080421 1.219975
