program: Gaussian 09
title: 000280946
version: EM64L-G09RevD.01
frameworkgroup: C1[X(C10H12N2O3S)]
method: RPBEPBE
basis: SDD
operation: Freq
keyword: #p
keyword: freq=noraman
keyword: PBEPBE/SDD
title: #p freq=noraman PBEPBE/SDD
converged: NO YES NO NO
title: Mulliken charges:
elementType: S O O O N N C C C C C C C C C C H H H H H H H H H H H H
charge: 0.944591 -0.545836 -0.539622 -0.263963 -0.478521 -0.716992 -0.065367 0.503805 -0.207673 -0.224428 -0.432054 -0.322151 0.232750 -0.367030 -0.047955 -0.737831 0.283911 0.280229 0.232404 0.321592 0.306546 0.333901 0.333616 0.214332 0.258076 0.238661 0.238254 0.226755
chargesum: 0.00000
title: Mulliken charges with hydrogens summed into heavy atoms:
elementType: S O O O N N C C C C C C C C C C
charge: 0.944591 -0.545836 -0.539622 -0.263963 -0.171975 -0.049474 -0.065367 0.503805 0.076238 0.055801 -0.199649 -0.000559 0.232750 -0.152698 0.210120 -0.034161
polarizability: 3.03897216e+02 -7.99922390e+00 1.48739578e+02 -2.81717900e+00 3.80804888e-01 8.78105028e+01
1716.lowfreq: 0.0010 0.0015 0.0018 2.5688 4.1342 8.9590 25.9696 31.4159 66.1605
frequency: 25.8354 31.4094 66.1433 69.2768 84.5429 115.5693 130.1126 132.2262 173.9851 183.4589 200.1742 225.8498 229.7391 270.6348 297.5352 323.5041 328.6326 378.3653 379.0984 405.7457 415.0048 441.3817 475.2734 538.5143 615.0398 629.4247 642.2328 671.4887 734.9072 748.4994 793.5032 804.5556 823.9781 833.5583 838.0844 870.3107 905.2719 916.1379 963.1912 976.6929 987.3295 991.8335 1000.7573 1055.3165 1057.8784 1070.7986 1105.1147 1122.7602 1169.4073 1183.5162 1262.1719 1289.3428 1292.4967 1321.1454 1372.2506 1394.4869 1409.4895 1456.4017 1465.2034 1475.8176 1502.5952 1533.8428 1593.1640 1600.6111 1611.1834 1673.1060 2970.3691 3043.8443 3083.9003 3095.9875 3111.4716 3124.5353 3159.4809 3165.8180 3198.4771 3362.1195 3525.3878 3529.8450
redmass: 4.7509 5.1572 4.1252 5.0757 2.8631 1.5176 2.2080 6.0249 3.9169 4.5595 1.5996 4.3837 4.7436 2.4449 8.1586 7.4387 6.0820 5.4208 5.5821 3.8739 2.9827 9.2171 3.7614 2.7366 6.9072 6.4137 1.2119 3.0631 3.3114 5.1704 3.3904 2.5520 4.2646 1.4801 1.8905 1.4610 4.0410 2.0898 1.3724 1.0733 5.0837 3.5683 1.3372 1.5982 2.4402 1.4758 1.9963 1.3096 2.5139 1.1279 2.0076 1.4685 1.3216 1.5255 4.1173 1.2309 5.0625 1.0471 1.0884 2.2986 2.3489 1.0855 8.5035 6.1963 3.9232 5.6171 1.0371 1.0957 1.0975 1.0939 1.0901 1.0902 1.0913 1.0952 1.0952 1.0414 1.0762 1.1000
irintensity: 1.7803 1.0920 5.9916 0.9211 1.0156 37.3328 3.8824 2.4766 0.0808 0.5064 0.2893 9.8555 5.5374 4.5498 3.9733 16.1636 5.5830 9.0102 9.0885 24.7961 0.2326 46.7211 140.4400 109.1756 2.7842 27.6875 45.3566 7.7062 0.2139 11.1348 22.7720 211.1181 50.2097 14.4349 26.4858 60.6459 66.6811 42.8308 0.3471 67.4684 6.5849 6.7608 3.1178 0.1873 50.9644 27.5284 47.4594 6.8831 108.5709 14.0260 78.7162 1.1792 58.2933 14.6249 247.8741 12.3501 14.4800 17.1004 60.9111 32.4241 473.9479 22.5966 68.3050 101.0300 98.6026 76.9721 20.2000 15.2784 15.1397 8.9495 18.1539 13.5090 2.1935 5.8371 10.3353 27.2203 12.2528 23.7659
temp: 298.150 k
press: 1.00000 atm
elementType: 16 8 8 8 7 7 6 6 6 6 6 6 6 6 6 6 1 1 1 1 1 1 1 1 1 1 1 1
symmnumber: 1
zpe: 544648.7 jmol-1
zpe.correction: 0.207446 hartree
zpe.thermalcorrener: 0.224635 hartree
zpe.thermalcorrenthalpy: 0.225580 hartree
zpe.thermalcorrgfe: 0.161083 hartree
zpe.sumelectzpe: -1120.139597 hartree
zpe.sumelectthermal: -1120.122407 hartree
zpe.sumelectthermalent: -1120.121463 hartree
zpe.sumelectthermalfe: -1120.185959 hartree
dipole: 6.0000 3.5448 2.9335
dipole: 7.5611
quadrupole: -86.2750 -99.3393 -107.4210
quadrupole: 10.4086 -16.9446 -1.1615
quadrupole: 11.4034 -1.6609 -9.7426 10.4086 -16.9446 -1.1615
hfenergy: -1120.3470425 hartree
pointgroup: C01 [X(C10H12N2O3S1)]
dipole: -2.3562323 -1.4157604 1.1371579 debye
polarizability: 303.9694203|-5.5148221|148.5076416|6.2145785|-1.2336855|87.9702358 unknown
InChI: InChI=1S/C10H12N2O3S/c1-2-3-10(13)12-8-4-6-9(7-5-8)16(11,14)15/h2-7,12H,11H2,1H3
charge 0 multiplicity 1
28 atoms
S  4.150919 0.206063 -0.033653
O  4.828559 -1.188185 -0.54088
O  4.451153 1.65497 -0.716415
O  -2.767753 1.476911 -0.032736
N  -1.855829 -0.69327 0.0156
N  4.602844 0.3692 1.747812
C  2.296398 -0.044455 -0.003558
C  -0.466751 -0.425078 0.007335
C  1.807633 -1.36092 0.03313
C  1.461408 1.082802 -0.046391
C  0.414354 -1.544745 0.036963
C  0.065067 0.895753 -0.041021
C  -2.92953 0.218719 -0.005032
C  -4.265943 -0.442435 0.008157
C  -5.409374 0.296991 -0.009743
C  -6.80908 -0.252469 -0.00089
H  2.498304 -2.209729 0.03277
H  1.891432 2.087576 -0.106896
H  0.006928 -2.562925 0.060578
H  -0.619206 1.744658 -0.074777
H  -2.112776 -1.683158 0.039256
H  5.26803 -0.389886 1.972811
H  5.002337 1.312729 1.886956
H  -4.314027 -1.540625 0.031185
H  -5.288563 1.390694 -0.033214
H  -7.365982 0.087563 -0.895809
H  -7.370532 0.126871 0.875172
H  -6.827822 -1.35542 0.02339
