program: Gaussian 09
title: 000280976
version: EM64L-G09RevD.01
frameworkgroup: C1[X(C13H10N2O7S)]
method: RPBEPBE
basis: SDD
operation: Freq
keyword: #p
keyword: freq=noraman
keyword: PBEPBE/SDD
title: #p freq=noraman PBEPBE/SDD
converged: YES YES NO NO
title: Mulliken charges:
elementType: S O O O O O O O N N C C C C C C C C C C C C C H H H H H H H H H H
charge: 0.907892 -0.223969 -0.506875 -0.509499 -0.309993 -0.194043 -0.194746 -0.241937 0.027336 -0.237048 -0.115487 -0.178503 -0.196746 0.399472 -0.350964 -0.333767 0.391110 -0.388783 -0.317889 -0.190857 -0.203042 0.356608 -0.240640 0.333690 0.302776 0.298560 0.299584 0.352424 0.259512 0.295092 0.238260 0.235640 0.236830
chargesum: 0.00000
title: Mulliken charges with hydrogens summed into heavy atoms:
elementType: S O O O O O O O N N C C C C C C C C C C C C C
charge: 0.907892 -0.223969 -0.506875 -0.509499 -0.309993 -0.194043 -0.194746 -0.241937 0.027336 0.115376 -0.115487 0.155187 0.106030 0.399472 -0.052404 -0.034183 0.391110 -0.129271 -0.022797 0.047403 0.032598 0.356608 -0.003810
polarizability: 4.04565044e+02 2.34652218e+01 2.43292444e+02 4.40759392e+00 1.02587226e+01 1.10233642e+02
1716.lowfreq: -2.2936 -0.0020 -0.0017 -0.0014 2.3129 6.6778 15.0064 19.1603 27.2660
frequency: 14.9769 19.1206 27.2493 36.8201 52.3885 67.1458 80.7906 82.3442 101.4989 121.4789 140.2849 158.1467 191.7156 213.0067 225.3433 252.7700 265.2744 282.4184 325.5342 330.8932 339.8337 370.8320 403.8016 408.5231 411.4124 432.0358 476.8295 495.4220 498.6770 506.0200 600.2613 605.5410 611.1472 644.1011 660.5482 662.0202 677.1801 689.5446 702.0397 730.4233 765.1092 780.7280 786.6771 800.7932 840.9999 856.4650 875.8904 910.3014 923.4790 943.7018 977.6741 985.6393 987.5238 995.9945 997.2932 1005.2650 1023.5305 1038.6776 1083.3914 1085.4811 1110.9514 1116.9400 1144.9256 1173.1670 1181.8752 1188.0945 1217.5598 1225.7955 1294.8289 1314.7518 1371.0614 1385.7942 1391.9769 1421.3080 1427.9863 1446.1296 1456.2720 1471.7183 1577.0593 1591.3330 1601.9494 1607.7141 1657.8760 3129.4625 3139.2344 3150.4947 3164.0875 3165.4566 3178.3387 3188.0959 3189.8373 3207.5111 3440.7197
redmass: 4.2326 6.2258 7.3632 8.8882 10.8598 6.2477 8.2183 9.7404 9.2622 11.9890 12.2597 8.5525 11.8845 6.4978 10.7044 6.5961 7.6344 7.8499 7.3404 7.1972 9.9199 14.1447 11.0149 2.9250 2.9420 7.2762 8.7421 3.2653 4.6642 7.2148 6.4687 6.5495 7.0932 1.8219 4.7081 3.5616 8.7046 2.3446 8.2638 4.1972 1.4863 10.6489 13.5077 7.9522 1.2474 1.2380 1.5135 19.2166 1.3962 8.3799 1.3660 6.3346 6.2579 1.3272 1.3151 1.3754 2.1538 2.2948 1.5223 3.8651 1.2996 5.3675 3.4587 1.0699 1.3064 1.2765 6.6713 5.4777 1.2727 1.3150 6.6168 9.8044 5.3661 6.1157 1.3776 2.1892 2.0189 2.1704 5.9637 6.2402 8.2022 6.6017 9.2428 1.0946 1.0858 1.0904 1.0908 1.0951 1.0997 1.0942 1.0957 1.0949 1.0780
irintensity: 0.0426 0.1667 0.1308 0.3214 0.1273 0.2144 0.2444 6.8082 4.7590 6.8999 22.4863 3.1960 4.9083 12.6253 1.6907 3.5870 7.8100 8.0477 3.5387 4.1513 9.2296 69.0830 9.6295 0.0305 0.1832 4.1982 14.2362 0.9578 56.0819 6.7956 12.7918 1.3577 0.7998 18.8225 3.0747 71.1405 23.2516 35.0728 17.1622 11.3390 94.7722 50.1856 78.2691 4.8825 0.0634 2.1642 60.2937 54.5504 10.8722 15.1824 0.0804 23.4683 5.0578 1.5589 0.8430 0.0928 11.8368 20.7907 17.0398 6.3585 14.3452 638.2057 462.0690 6.4649 17.6976 106.0188 258.9381 64.3777 0.6938 1.2487 52.8442 2.7535 48.9237 80.4365 160.3846 23.1193 15.6020 43.0532 27.6867 6.3732 2.7998 4.5911 149.5800 52.2587 0.1594 12.5664 8.9173 22.1822 13.1533 4.1699 0.6482 4.4836 58.7100
temp: 298.150 k
press: 1.00000 atm
elementType: 16 8 8 8 8 8 8 8 7 7 6 6 6 6 6 6 6 6 6 6 6 6 6 1 1 1 1 1 1 1 1 1 1
symmnumber: 1
zpe: 573671.1 jmol-1
zpe.correction: 0.218500 hartree
zpe.thermalcorrener: 0.239968 hartree
zpe.thermalcorrenthalpy: 0.240912 hartree
zpe.thermalcorrgfe: 0.163889 hartree
zpe.sumelectzpe: -1533.574408 hartree
zpe.sumelectthermal: -1533.552939 hartree
zpe.sumelectthermalent: -1533.551995 hartree
zpe.sumelectthermalfe: -1533.629019 hartree
dipole: 5.7689 -0.0247 0.6369
dipole: 5.8040
quadrupole: -129.3015 -147.4684 -145.4387
quadrupole: 14.8694 -0.4993 -5.8130
quadrupole: 11.4347 -6.7322 -4.7025 14.8694 -0.4993 -5.8130
hfenergy: -1533.7929073 hartree
pointgroup: C01 [X(C13H10N2O7S1)]
dipole: 2.2389129 0.252478 0.3711221 debye
polarizability: 401.1636267|36.2618285|216.0008503|12.0847077|-54.7505667|140.9266537 unknown
InChI: InChI=1S/C7H6NO3.C6H4NO4S/c9-7(8-10)11-6-4-2-1-3-5-6;8-7(9)5-1-3-6(4-2-5)12(10)11/h1-5,8H;1-4H
charge 0 multiplicity 1
33 atoms
S  -0.874396 -2.259548 1.027685
O  0.125332 -1.043305 2.619536
O  -1.618436 -3.656808 1.431302
O  0.442785 -2.275199 0.046449
O  3.24213 -0.314718 1.171844
O  -4.848395 2.531816 -1.771805
O  -6.393985 0.887372 -1.437913
O  1.189264 0.819813 0.750007
N  -5.195497 1.357959 -1.367093
N  1.409948 -0.996788 2.25237
C  -2.198509 -1.120284 0.295914
C  -1.818988 0.162482 -0.133097
C  -3.50789 -1.628752 0.230331
C  -4.140173 0.485236 -0.778015
C  -2.821849 0.984313 -0.6896
C  -4.504184 -0.802967 -0.328578
C  4.138016 0.416962 0.325271
C  5.438794 -0.129642 0.293143
C  3.792615 1.577824 -0.401678
C  6.425879 0.502304 -0.49059
C  4.799721 2.194048 -1.180249
C  1.882306 -0.057295 1.299217
C  6.109722 1.666932 -1.230187
H  -0.787792 0.517726 -0.023286
H  -3.730734 -2.636092 0.595311
H  -2.599378 1.993652 -1.044221
H  -5.540977 -1.135841 -0.420145
H  2.052936 -1.735142 2.571671
H  5.656562 -1.031698 0.872186
H  2.780424 1.982406 -0.368978
H  7.437332 0.084453 -0.523224
H  4.549232 3.094122 -1.75171
H  6.876686 2.156361 -1.839172
