program: Gaussian 09
title: 000280943
version: EM64L-G09RevD.01
frameworkgroup: C1[X(C10H18)]
method: RPBEPBE
basis: SDD
operation: Freq
keyword: #p
keyword: freq=noraman
keyword: PBEPBE/SDD
title: #p freq=noraman PBEPBE/SDD
converged: YES YES NO NO
title: Mulliken charges:
elementType: C C C C C C C C C C H H H H H H H H H H H H H H H H H H
charge: -0.096011 -0.407597 -0.464917 -0.317439 -0.723086 0.359655 -0.025444 -0.789423 -0.791890 -0.588315 0.217914 0.193316 0.195556 0.198809 0.220790 0.220430 0.210686 0.204920 0.224453 0.208473 0.227500 0.215061 0.214584 0.238522 0.210859 0.218578 0.212290 0.211725
chargesum: 0.00000
title: Mulliken charges with hydrogens summed into heavy atoms:
elementType: C C C C C C C C C C
charge: 0.121903 -0.018725 -0.045318 -0.097009 -0.083026 0.359655 0.183029 -0.132279 -0.123930 -0.164300
polarizability: 1.10922562e+02 -1.39548460e+01 1.21690129e+02 2.51172912e+00 9.08017082e+00 9.03448078e+01
1716.lowfreq: -12.2079 -5.8735 -0.0005 -0.0005 -0.0004 10.1923 28.5208 47.8821 68.7409
frequency: 27.6634 47.8389 68.6965 95.9780 127.6815 132.9755 182.8234 193.5851 210.3200 236.4394 293.7767 341.4652 372.7298 408.0804 423.1233 454.3859 494.7843 502.8930 636.9733 785.0728 816.8832 829.2503 856.9739 909.0746 928.2532 934.7777 944.0243 950.3109 994.9173 1004.3119 1019.9115 1051.3456 1070.9586 1079.0297 1083.0225 1104.1846 1159.7135 1192.3314 1220.6670 1238.2532 1281.6816 1287.0059 1304.6668 1320.6832 1333.3007 1362.7670 1380.8847 1389.6739 1399.6844 1425.0214 1454.5157 1456.2903 1459.1706 1465.7728 1470.2753 1471.6763 1474.6764 1478.5775 1655.7987 1692.2779 2954.4655 2955.7299 2961.3234 2965.1370 2968.2030 2994.8665 3017.1436 3025.5184 3028.4728 3034.9950 3045.2015 3059.7115 3065.7817 3076.4712 3078.5555 3088.8766 3094.8817 3191.3505
redmass: 2.7174 3.3487 2.6504 2.3155 2.1574 1.0911 1.3559 1.8150 1.2763 1.8228 2.0143 2.2387 2.3792 2.2098 2.3578 2.1897 2.8248 2.2623 1.4584 2.3221 2.1966 1.9485 1.4353 1.5612 1.4672 1.3643 1.4705 1.5014 1.2492 1.1315 2.1334 1.8059 1.9189 1.6371 1.6327 2.3259 1.8977 1.7426 1.3682 1.9611 1.2132 1.2566 1.4386 1.3271 1.4053 1.4437 1.2236 1.2990 1.2192 1.1751 1.0543 1.0943 1.0922 1.0508 1.0471 1.0475 1.0641 1.0716 4.7127 6.6050 1.0597 1.0376 1.0388 1.0436 1.0542 1.0854 1.0993 1.0969 1.0962 1.0959 1.0895 1.0983 1.0819 1.0994 1.0976 1.0719 1.0957 1.1145
irintensity: 0.1204 0.1676 0.0201 0.3266 0.7918 0.0020 0.5726 0.2721 0.0724 0.2453 0.8388 0.8351 0.5457 5.1578 1.0346 4.0412 0.7796 0.0893 17.3974 3.5164 3.8121 3.6112 13.7413 2.0264 3.0851 66.4602 25.9239 5.0067 6.0144 13.7590 3.4201 11.8898 7.2366 4.1405 5.0149 9.4628 0.9076 1.7280 1.6840 3.1472 0.6109 0.8810 0.4895 2.1217 0.9429 2.0690 11.1643 27.0831 8.6784 7.6330 0.5971 19.1330 2.7590 8.7090 16.8113 21.8359 17.8939 1.5064 14.1332 3.8578 26.7740 35.9182 64.7935 41.8038 53.6537 4.8189 28.3597 0.0634 58.5470 16.2518 15.3408 60.7355 51.4709 36.5923 44.9102 5.7919 31.1056 34.5031
temp: 298.150 k
press: 1.00000 atm
elementType: 6 6 6 6 6 6 6 6 6 6 1 1 1 1 1 1 1 1 1 1 1 1 1 1 1 1 1 1
symmnumber: 1
zpe: 655533.0 jmol-1
zpe.correction: 0.249679 hartree
zpe.thermalcorrener: 0.262897 hartree
zpe.thermalcorrenthalpy: 0.263842 hartree
zpe.thermalcorrgfe: 0.209448 hartree
zpe.sumelectzpe: -391.010121 hartree
zpe.sumelectthermal: -390.996903 hartree
zpe.sumelectthermalent: -390.995959 hartree
zpe.sumelectthermalfe: -391.050352 hartree
dipole: 0.1803 0.1185 -0.0131
dipole: 0.2162
quadrupole: -63.5124 -64.1433 -63.7363
quadrupole: -3.3593 1.4154 1.6755
quadrupole: 0.2849 -0.3459 0.0610 -3.3593 1.4154 1.6755
hfenergy: -391.2598006 hartree
pointgroup: C01 [X(C10H18)]
dipole: -0.0706099 0.0473522 -0.0019939 debye
polarizability: 110.7398543|14.8606169|120.7552767|3.4336592|-9.1023566|91.4623681 unknown
InChI: InChI=1S/C10H18/c1-5-6-7-10(4)8-9(2)3/h5,8,10H,1,6-7H2,2-4H3
charge 0 multiplicity 1
28 atoms
C  0.09452 1.209356 0.321593
C  1.389665 1.245708 -0.542336
C  1.941426 -0.15871 -0.912757
C  -1.07235 0.646595 -0.473481
C  -0.247652 2.637768 0.826969
C  -1.876381 -0.416458 -0.180907
C  2.510877 -0.903302 0.277996
C  -3.026639 -0.800618 -1.100637
C  -1.733211 -1.297304 1.048785
C  2.12274 -2.13143 0.706645
H  0.294894 0.569714 1.202616
H  2.171518 1.81335 0.004304
H  1.182114 1.812612 -1.473456
H  2.743869 -0.029375 -1.669373
H  1.140535 -0.757471 -1.386487
H  -1.290906 1.207077 -1.399244
H  0.588992 3.060156 1.415832
H  -0.440813 3.319483 -0.023982
H  -1.15119 2.628284 1.462448
H  3.311771 -0.378676 0.825826
H  -3.100042 -0.127224 -1.972539
H  -3.994518 -0.769516 -0.560687
H  -2.908769 -1.837465 -1.475007
H  -0.83802 -1.062371 1.646123
H  -1.67499 -2.365097 0.757078
H  -2.621605 -1.199497 1.705012
H  2.588386 -2.614538 1.573712
H  1.326377 -2.689251 0.197755
