program: Gaussian 09
title: 000280947
version: EM64L-G09RevD.01
frameworkgroup: C1[X(C15H14N2O3S)]
method: RPBEPBE
basis: SDD
operation: Freq
keyword: #p
keyword: freq=noraman
keyword: PBEPBE/SDD
title: #p freq=noraman PBEPBE/SDD
converged: NO YES NO NO
title: Mulliken charges:
elementType: S O O O N N C C C C C C C C C C C C C C C H H H H H H H H H H H H H H
charge: 0.945596 -0.539814 -0.546108 -0.263958 -0.481482 -0.719283 -0.065890 0.509069 -0.207632 -0.224681 -0.435405 -0.322806 0.473002 0.217149 -0.215667 -0.400210 -0.367043 -0.381841 -0.235106 -0.233851 -0.231422 0.283725 0.280353 0.232108 0.322123 0.305944 0.265369 0.205848 0.334275 0.334773 0.222987 0.239424 0.230888 0.234197 0.235370
chargesum: 0.00000
title: Mulliken charges with hydrogens summed into heavy atoms:
elementType: S O O O N N C C C C C C C C C C C C C C C
charge: 0.945596 -0.539814 -0.546108 -0.263958 -0.175538 -0.050235 -0.065890 0.509069 0.076092 0.055672 -0.203297 -0.000683 0.473002 0.217149 0.049701 -0.194362 -0.144056 -0.142417 -0.004219 0.000346 0.003948
polarizability: 4.81392135e+02 5.44915102e+00 2.02149212e+02 3.14700356e+00 2.83686761e-01 1.00951223e+02
1716.lowfreq: -0.0009 0.0015 0.0018 2.2528 6.1520 7.4437 20.5867 23.6177 35.5877
frequency: 20.4812 22.5531 35.3242 40.7851 59.7174 92.9471 101.2616 103.0784 115.0526 145.8030 157.4628 179.7623 213.4533 248.9809 268.6367 278.2560 284.8869 297.8085 327.9188 377.6616 381.9933 403.4243 414.3855 421.1762 466.6198 481.9410 491.5594 538.4422 557.7672 615.2708 617.4088 636.7506 638.8877 680.1183 701.1449 733.8637 741.9829 776.2856 790.4539 802.5976 826.4603 833.1556 847.3642 851.9714 869.4145 874.3371 904.8921 927.5884 962.5975 974.8159 980.8538 987.8970 989.2746 998.6601 999.9784 1012.8131 1026.5564 1058.0082 1070.2425 1084.8440 1122.0341 1145.2443 1175.5491 1182.7314 1192.2059 1220.1733 1262.4569 1290.5255 1298.1009 1324.9573 1336.1611 1371.6869 1387.5267 1410.0153 1441.3348 1474.9383 1486.1186 1501.2897 1533.5983 1582.2543 1587.9163 1598.1540 1603.6706 1612.1307 1652.6377 3097.7194 3107.7219 3122.5352 3125.6193 3128.7287 3141.1584 3152.4500 3159.2444 3165.9438 3168.2968 3198.9248 3366.4465 3525.7251 3534.9596
redmass: 6.9091 5.3126 3.6748 6.5523 4.9816 4.7533 6.8961 5.1482 1.5805 7.2644 4.2355 6.3214 4.2183 7.8371 3.0236 3.1756 4.3884 8.1020 8.7091 5.4809 5.3177 2.7555 2.9817 8.5589 4.4849 4.1494 2.9218 2.7149 6.7285 6.4564 7.0109 5.1100 1.2714 3.6648 1.7773 3.5053 5.5881 2.0062 2.3620 3.8292 5.1085 1.4113 1.2965 4.4225 1.4631 1.8194 4.1417 1.4201 1.3810 5.4176 1.3844 5.1735 6.0486 1.3099 1.3384 1.2525 2.2025 2.4454 1.4778 1.6017 1.3082 2.6811 1.0661 1.1240 1.1212 1.5717 2.0400 1.4362 2.0444 1.5651 1.2788 4.0178 7.1221 5.0952 2.2929 2.3719 2.3169 2.3575 1.0857 5.6778 8.9428 5.8859 4.2238 5.5982 5.2669 1.0920 1.0882 1.0903 1.0864 1.0870 1.0915 1.0964 1.0913 1.0951 1.1016 1.0951 1.0413 1.0762 1.1002
irintensity: 0.2473 0.6894 1.8087 0.0623 3.3862 6.5330 1.6813 1.0294 34.1093 0.8067 0.9951 5.0527 0.2728 0.9885 5.2854 3.8700 18.3887 1.8256 26.1645 7.3040 4.2130 0.0095 0.3348 55.6569 66.4962 83.9481 43.7334 92.4511 58.5919 0.3287 0.9272 19.6992 34.7461 11.0972 39.3920 1.3866 9.1344 70.9006 40.6062 242.9790 29.9729 28.5544 1.5081 3.7775 55.7701 29.9939 60.2713 0.0038 0.4437 8.7096 0.5093 3.6005 0.8494 8.3410 2.9677 36.5050 2.9022 59.1223 28.0719 11.6700 8.4601 322.9268 2.1740 16.2563 16.9869 13.0746 120.1609 30.0352 23.4750 19.3565 23.1922 302.3077 33.1092 14.7028 25.6340 59.4667 6.5774 594.5287 22.2988 13.8477 124.9492 285.4171 18.9596 12.3943 80.7209 0.6678 14.8258 13.6126 5.6991 1.9611 4.7544 35.9463 2.2989 5.6292 33.5838 11.6439 29.4831 10.7016 24.5688
temp: 298.150 k
press: 1.00000 atm
elementType: 16 8 8 8 7 7 6 6 6 6 6 6 6 6 6 6 6 6 6 6 6 1 1 1 1 1 1 1 1 1 1 1 1 1 1
symmnumber: 1
zpe: 682676.0 jmol-1
zpe.correction: 0.260018 hartree
zpe.thermalcorrener: 0.280215 hartree
zpe.thermalcorrenthalpy: 0.281159 hartree
zpe.thermalcorrgfe: 0.208373 hartree
zpe.sumelectzpe: -1311.565582 hartree
zpe.sumelectthermal: -1311.545385 hartree
zpe.sumelectthermalent: -1311.544441 hartree
zpe.sumelectthermalfe: -1311.617227 hartree
dipole: -6.7725 3.5245 2.8921
dipole: 8.1641
quadrupole: -122.2303 -122.4082 -138.8206
quadrupole: -4.1190 22.4995 -0.8258
quadrupole: 5.5894 5.4115 -11.0009 -4.1190 22.4995 -0.8258
hfenergy: -1311.8255998 hartree
pointgroup: C01 [X(C15H14N2O3S1)]
dipole: -2.6569794 1.424814 1.107891 debye
polarizability: 481.4228525|2.6464713|202.0624269|5.406458|-0.7308993|101.0072902 unknown
InChI: InChI=1S/C15H14N2O3S/c16-21(19,20)14-9-7-13(8-10-14)17-15(18)11-6-12-4-2-1-3-5-12/h1-11,17H,16H2
charge 0 multiplicity 1
35 atoms
S  6.181713 -0.120296 -0.050004
O  6.530003 -1.58287 -0.679146
O  6.804417 1.277604 -0.615034
O  -0.685028 -1.646929 0.032031
N  0.145668 0.557398 0.00075
N  6.650355 -0.196844 1.728511
C  4.318821 0.062864 -0.017614
C  1.54296 0.340474 -0.005407
C  3.781223 1.360828 -0.025116
C  3.526045 -1.095484 -0.015778
C  2.382147 1.492493 -0.020545
C  2.123779 -0.960645 -0.009501
C  -4.769114 -0.164974 0.0226
C  -0.894735 -0.394362 0.017144
C  -3.36197 -0.582562 0.025011
C  -2.250267 0.214862 0.014664
C  -5.180899 1.200637 0.021716
C  -5.776035 -1.173689 0.020913
C  -6.547239 1.539189 0.017575
C  -7.145005 -0.835022 0.016605
C  -7.536281 0.523794 0.01466
H  4.439717 2.234115 -0.059888
H  3.992844 -2.085174 -0.043254
H  1.936785 2.494998 -0.031618
H  1.471545 -1.835042 -0.009963
H  -0.146903 1.537495 -0.008926
H  -3.167237 -1.665615 0.03473
H  -2.330638 1.310351 0.002083
H  7.076887 -1.120926 1.90858
H  7.28736 0.593471 1.923506
H  -4.431128 1.999843 0.025446
H  -5.473213 -2.227911 0.022302
H  -6.848323 2.592637 0.016925
H  -7.903421 -1.625221 0.014854
H  -8.598532 0.791716 0.011288
