program: Gaussian 09
title: 000281047
version: EM64L-G09RevD.01
frameworkgroup: C1[X(C24H23N5O3)]
method: RPBEPBE
basis: SDD
operation: Freq
keyword: #p
keyword: freq=noraman
keyword: PBEPBE/SDD
title: #p freq=noraman PBEPBE/SDD
converged: YES YES NO NO
title: Mulliken charges:
elementType: O O O N N N N N C C C C C C C C C C C C C C C C C C C C C C C C H H H H H H H H H H H H H H H H H H H H H H H
charge: -0.230913 -0.220925 -0.219375 -0.151863 -0.267875 -0.048407 -0.019875 0.017249 0.197488 -0.562594 0.356768 -0.373838 -0.368034 0.567599 -0.336305 -0.326030 0.345099 -0.391809 -0.352640 -0.409792 -0.394469 -0.230903 -0.353647 -0.247022 -0.247833 -0.242070 -0.231904 -0.231611 -0.442984 -0.360264 -0.238484 0.401852 0.279866 0.245985 0.236891 0.260192 0.228466 0.187915 0.225073 0.224857 0.187814 0.271736 0.260624 0.223015 0.248010 0.274374 0.297913 0.229626 0.234201 0.234105 0.227899 0.228801 0.288754 0.288174 0.231119
chargesum: 0.00000
title: Mulliken charges with hydrogens summed into heavy atoms:
elementType: O O O N N N N N C C C C C C C C C C C C C C C C C C C C C C C C
charge: -0.230913 -0.220925 -0.219375 -0.151863 -0.267875 -0.048407 -0.019875 0.017249 0.197488 -0.282728 0.356768 0.109039 0.120623 0.567599 0.076683 0.086642 0.345099 -0.120073 -0.092016 -0.186777 -0.146459 0.043471 -0.055734 -0.017396 -0.013631 -0.007966 -0.004005 -0.002810 -0.154230 -0.072090 -0.007365 0.401852
polarizability: 4.31208317e+02 2.22834316e+01 2.68599107e+02 6.03937895e+00 -3.18246128e-01 2.73424063e+02
1716.lowfreq: -7.0879 -3.0394 -0.0005 0.0003 0.0006 4.2616 17.2645 30.2043 35.8591
frequency: 17.2252 30.1778 35.8388 45.4952 52.3608 59.0877 70.2493 74.1351 82.6266 97.3718 118.0119 125.7921 152.6643 165.0473 196.1383 210.0705 229.0553 233.0245 246.5948 254.7901 271.6718 285.4241 306.9733 329.1793 331.8776 375.9173 380.1648 403.1014 413.3137 420.6173 423.8661 454.3652 467.4327 477.2695 495.1864 509.7182 512.2753 521.6007 541.5492 577.1121 615.0503 617.4640 623.6896 641.7959 651.6408 667.4114 668.4520 682.4669 700.3449 710.9792 732.5534 741.7940 762.7393 774.7804 789.3279 794.5533 819.2344 839.8117 844.4890 849.2018 856.4193 864.5019 867.4435 870.1932 896.4957 918.7114 925.4680 940.8818 943.6208 965.3264 975.6713 985.8673 991.1054 992.2591 993.7379 995.5873 996.6377 999.3718 1003.3943 1004.7551 1019.7409 1024.8281 1031.9527 1036.9455 1055.5612 1082.8883 1085.2029 1087.4912 1092.8374 1100.1280 1122.7148 1128.3523 1146.8023 1174.5301 1174.9001 1181.4241 1189.3332 1193.8574 1196.1311 1201.7253 1212.0999 1227.0037 1229.8084 1264.7477 1275.3085 1286.1629 1301.5322 1308.0292 1313.8321 1318.5607 1338.0591 1346.5527 1349.9025 1350.5289 1367.7252 1375.5302 1378.9312 1381.5223 1389.0547 1415.0717 1437.4218 1440.7816 1444.5730 1445.0698 1452.3488 1457.0217 1470.0479 1482.1820 1483.9909 1485.5647 1582.0381 1589.8228 1595.4314 1608.8991 1612.5814 1613.4987 2924.3373 2941.4900 2951.1346 2955.0827 3054.5080 3071.2507 3075.0896 3084.1054 3087.1627 3119.0620 3127.6812 3128.6347 3135.0462 3140.3643 3146.6079 3150.8708 3154.7338 3166.4005 3168.6415 3175.9276 3176.2752 3199.3601 3202.0933
redmass: 6.7569 5.4589 4.4380 7.0867 5.0579 5.6525 4.1311 5.7954 5.3408 3.4363 6.1302 5.3333 5.8383 6.8292 6.8384 5.5413 3.3337 4.7842 4.1052 5.6466 4.6695 4.8388 3.6213 3.9938 4.9766 4.0614 4.1213 2.7922 2.9591 3.0667 2.4567 5.1194 3.2997 8.4862 3.8115 5.1760 3.7368 4.9617 3.7762 3.7748 6.3838 6.3366 7.1056 6.9141 5.3748 3.7117 3.7147 7.9766 1.7942 2.0147 5.0447 2.9196 1.8725 3.7200 7.0879 4.2584 4.4438 1.3036 1.6007 1.2799 4.0518 1.5701 2.1519 1.7456 3.0138 4.2809 1.5659 2.0142 3.1915 5.4224 1.4030 1.3848 5.8158 5.1949 1.4575 1.8770 2.7156 1.8368 1.3302 1.4505 2.5493 2.7424 2.1316 2.4197 1.8593 2.4858 2.6320 1.6558 2.0696 3.0066 1.3277 2.3348 4.5524 1.0552 1.0548 1.5074 1.1451 1.1198 1.1369 1.3830 2.8268 3.5505 1.9470 1.4121 1.3202 1.4896 1.3257 2.1438 2.0477 1.3764 1.2717 1.3589 1.4825 3.5473 1.4939 1.6190 4.7781 3.7559 5.7557 6.5231 2.2251 4.0872 1.5546 1.2669 1.0968 1.1437 1.1110 2.2756 2.3984 2.4642 8.1257 6.2152 6.0067 6.3821 6.0924 6.0248 1.0701 1.0688 1.0669 1.0664 1.0848 1.0902 1.0942 1.0950 1.0968 1.0874 1.0852 1.0862 1.0875 1.0915 1.0923 1.0960 1.0957 1.1015 1.1013 1.0899 1.0899 1.0946 1.0953
irintensity: 0.1205 0.1302 0.3188 0.5801 0.0664 0.0701 0.3855 0.6554 1.0321 0.1812 1.8160 1.4491 1.0491 1.6031 4.2945 1.9616 3.0469 1.6655 0.4740 4.4436 2.1656 3.5656 5.4152 3.9514 0.6518 4.4045 1.4238 0.5275 0.0252 0.0763 2.3675 0.6907 2.3844 2.7223 8.4813 3.8851 10.2467 7.4503 6.7110 0.2288 0.1291 1.0180 2.1113 8.8165 6.2410 3.8904 20.1317 11.1663 51.2823 25.8106 5.9698 54.3924 33.4792 35.3212 32.4132 44.3288 30.8289 5.5745 0.5859 4.3438 11.5585 24.2350 90.1741 30.6707 60.3572 109.7656 7.9901 67.0683 154.2418 28.4706 0.0815 8.3912 2.8295 0.7346 3.2202 13.2811 6.3666 25.4680 0.2558 4.1395 4.5106 2.5163 5.6709 10.7782 14.5288 30.2412 33.2089 9.4801 14.6276 23.1873 27.8501 57.1346 9.8868 0.4262 0.1431 257.4186 6.5522 2.7432 8.8368 26.2502 15.8503 618.2604 24.8595 17.1996 1.5683 20.8760 2.6021 75.9600 113.0637 13.2242 7.1948 8.2241 9.2212 91.3813 6.4165 8.4041 3.0482 17.4645 17.3601 50.6444 16.3144 11.9001 4.4487 9.6523 17.0941 4.4801 14.9226 23.9839 82.3496 29.0240 3.9719 0.8620 0.6625 320.7595 5.0963 18.7924 31.0864 23.7816 16.1511 125.8100 5.0839 17.5822 14.4288 28.3163 25.5501 5.8628 1.1270 0.5203 0.5879 13.7387 13.8564 19.6134 31.8953 21.1459 17.5608 1.1097 0.8493 0.2499 3.0453
temp: 298.150 k
press: 1.00000 atm
elementType: 8 8 8 7 7 7 7 7 6 6 6 6 6 6 6 6 6 6 6 6 6 6 6 6 6 6 6 6 6 6 6 6 1 1 1 1 1 1 1 1 1 1 1 1 1 1 1 1 1 1 1 1 1 1 1
symmnumber: 1
zpe: 1129299.0 jmol-1
zpe.correction: 0.430127 hartree
zpe.thermalcorrener: 0.456645 hartree
zpe.thermalcorrenthalpy: 0.457589 hartree
zpe.thermalcorrgfe: 0.372155 hartree
zpe.sumelectzpe: -1425.344065 hartree
zpe.sumelectthermal: -1425.317547 hartree
zpe.sumelectthermalent: -1425.316603 hartree
zpe.sumelectthermalfe: -1425.402037 hartree
dipole: 8.5223 0.7304 2.5016
dipole: 8.9119
quadrupole: -227.0401 -184.9029 -185.4187
quadrupole: -10.0112 13.6419 0.1554
quadrupole: -27.9195 14.2177 13.7018 -10.0112 13.6419 0.1554
hfenergy: -1425.7741922 hartree
pointgroup: C01 [X(C24H23N5O3)]
dipole: -3.2650714 0.1787009 -1.2652758 debye
polarizability: 426.1762851|-28.0243319|271.6111125|23.1475649|-1.1067868|275.4440904 unknown
InChI: InChI=1S/C24H23N5O3/c30-29(31)22-13-11-21(12-14-22)28-24(20-9-5-2-6-10-20,27-15-17-32-18-16-27)23(25-26-28)19-7-3-1-4-8-19/h1-14,23H,15-18H2
charge 0 multiplicity 1
55 atoms
O  0.936893 4.514587 -1.416114
O  6.05051 -2.063478 -0.582997
O  6.346932 -1.748454 1.660142
N  -0.335366 2.028493 -0.565558
N  0.262867 0.199944 1.05017
N  -1.367871 1.040735 2.367056
N  -0.154177 0.594349 2.356721
N  5.626192 -1.69917 0.585516
C  -0.74398 0.725798 -0.004349
C  -1.980829 0.950987 0.985291
C  -1.089103 -0.29595 -1.09147
C  0.7295 2.052788 -1.615745
C  -0.076232 3.135787 0.401733
C  -3.091721 -0.094282 0.993168
C  0.690749 3.40386 -2.347547
C  -0.066563 4.483702 -0.343502
C  1.597183 -0.248908 0.911958
C  -1.714169 0.141119 -2.287015
C  -0.921888 -1.685416 -0.877234
C  -4.248272 0.121913 0.204412
C  -3.00719 -1.264435 1.787109
C  2.117649 -0.66578 -0.348565
C  2.436594 -0.325517 2.067373
C  -2.127748 -0.789517 -3.263722
C  -1.337986 -2.616823 -1.851863
C  -1.937353 -2.174504 -3.0529
C  -5.295818 -0.823712 0.190943
C  -4.057031 -2.208414 1.779281
C  3.434037 -1.138191 -0.454561
C  3.751408 -0.796558 1.960219
C  -5.202856 -1.993924 0.979124
C  4.246585 -1.201636 0.698425
H  -2.43231 1.927439 0.74012
H  1.738121 1.923428 -1.166852
H  0.562852 1.240441 -2.341025
H  -0.857644 3.175625 1.17813
H  0.899682 2.989556 0.918969
H  -0.296317 3.53678 -2.842514
H  1.494057 3.465546 -3.099917
H  0.207599 5.302704 0.341408
H  -1.075964 4.675483 -0.769132
H  -1.878457 1.213259 -2.439479
H  -0.469733 -2.042999 0.053496
H  -4.327441 1.031411 -0.403937
H  -2.135441 -1.428302 2.429954
H  1.491352 -0.64166 -1.240673
H  2.038879 -0.010492 3.033184
H  -2.604418 -0.433799 -4.18386
H  -1.197384 -3.687684 -1.669717
H  -2.258378 -2.898569 -3.809594
H  -6.183498 -0.646307 -0.426118
H  -3.984518 -3.106633 2.402502
H  3.841504 -1.46343 -1.415242
H  4.404966 -0.856024 2.834529
H  -6.017856 -2.726166 0.976468
