program: Gaussian 09
title: 000280907
version: EM64L-G09RevD.01
frameworkgroup: C1[X(C6H8N2OS)]
method: RPBEPBE
basis: SDD
operation: Freq
keyword: #p
keyword: freq=noraman
keyword: PBEPBE/SDD
title: #p freq=noraman PBEPBE/SDD
converged: NO NO NO NO
title: Mulliken charges:
elementType: S O N N C C C C C C H H H H H H H H
charge: 0.218990 -0.185540 -0.340793 0.016229 0.411159 -0.172059 -0.671991 -0.752939 0.213501 -0.801551 0.326867 0.277412 0.219533 0.245247 0.245284 0.239202 0.272214 0.239237
chargesum: 0.00000
title: Mulliken charges with hydrogens summed into heavy atoms:
elementType: S O N N C C C C C C
charge: 0.218990 -0.185540 -0.013926 0.016229 0.411159 -0.172059 -0.394579 -0.042875 0.213501 -0.050898
polarizability: 1.42668206e+02 -2.77347820e+00 1.10695724e+02 -8.43896109e-03 -1.37873573e-03 4.87217063e+01
1716.lowfreq: -48.8205 -3.0136 -0.0012 -0.0006 0.0018 7.8214 10.4578 18.5701 84.3213
frequency: -48.8000 11.1456 84.3212 116.2174 140.4123 214.9113 262.9393 272.9095 289.4534 367.5582 516.3092 525.4781 527.9737 583.2947 586.5847 601.2132 629.5678 741.9525 745.1686 800.4119 867.2794 943.4580 989.4611 1001.2863 1029.9113 1048.9449 1113.3121 1160.9870 1200.6867 1307.3253 1374.1274 1402.3337 1442.9096 1455.6674 1462.0418 1467.2605 1482.5866 1538.4709 1575.8955 1665.4739 2986.1848 2992.2352 3071.7497 3077.2743 3105.6542 3139.4792 3243.3158 3537.4939
redmass: 1.0838 6.6963 3.1464 4.7810 1.0720 3.5308 7.5524 4.5106 3.5949 3.4094 8.6292 4.2598 5.0574 3.4399 6.0561 1.2560 4.3968 1.2439 5.3353 5.4184 5.4417 2.7134 2.7717 1.5234 1.6599 1.4953 2.4579 1.8372 2.7381 4.9880 1.2279 1.2534 1.1798 1.0441 1.2019 1.0468 1.4859 3.8981 7.2554 6.6187 1.0383 1.0364 1.0985 1.0983 1.1000 1.0979 1.0962 1.0771
irintensity: 0.1383 5.6368 4.4063 5.0326 0.5373 7.6681 1.5090 1.3336 1.0771 0.0853 20.1371 6.2880 18.9419 8.6254 7.4175 83.8500 11.3239 43.8478 1.1798 14.0631 5.2118 35.0554 20.0884 3.7400 9.6475 10.4801 41.9004 10.4803 240.1510 13.6542 52.9050 20.1339 195.9419 14.2818 13.0165 20.3583 401.4105 17.1171 157.7479 164.5451 7.4160 22.3422 14.2214 14.4072 16.7507 6.6756 2.0890 24.8416
temp: 298.150 k
press: 1.00000 atm
elementType: 16 8 7 7 6 6 6 6 6 6 1 1 1 1 1 1 1 1
symmnumber: 1
zpe: 351107.7 jmol-1
zpe.correction: 0.133730 hartree
zpe.thermalcorrener: 0.143753 hartree
zpe.thermalcorrenthalpy: 0.144697 hartree
zpe.thermalcorrgfe: 0.096200 hartree
zpe.sumelectzpe: -815.474989 hartree
zpe.sumelectthermal: -815.464967 hartree
zpe.sumelectthermalent: -815.464022 hartree
zpe.sumelectthermalfe: -815.512519 hartree
dipole: -0.2084 -3.7429 0.0036
dipole: 3.7487
quadrupole: -50.3623 -70.1713 -67.9392
quadrupole: 10.9220 -0.0126 0.0021
quadrupole: 12.4619 -7.3470 -5.1149 10.9220 -0.0126 0.0021
hfenergy: -815.6087192 hartree
pointgroup: C01 [X(C6H8N2O1S1)]
dipole: 0.1217019 1.4698403 -0.0004669 debye
dipolederiv: -0.2598881 -0.0362791 -0.0000141 0.2593838 -0.6002744 0.0012185 -0.0005554 0.0012604 0.0916069 -0.5209948 -0.0507086 -0.0001027 0.5661757 -0.9390291 -0.0000495 -0.0002236 0.0000285 -0.2992422 -2.0144563 0.4318203 -0.0002866 0.6581439 -0.5854732 0.0002871 -0.00017 0.0000902 -0.3373373 -0.6212089 -0.2651379 0.0003538 -0.3470621 -0.7705564 0.0011458 0.0002342 0.0010078 -0.1662903 0.3727849 0.215196 -0.0001495 0.2603833 0.3621112 -0.000459 -0.0001191 0.0001165 0.0279541 1.5009516 -0.2790357 0.0005751 -0.0134632 0.9068375 -0.0019868 0.0005666 -0.0018612 0.0403013 -0.1334376 0.2350403 -0.0004026 0.03187 0.0644969 -0.0006803 -0.0000296 -0.0008112 -0.3596955 0.0584217 -0.0258831 -0.0000868 -0.1450566 -0.1024951 0.0003266 -0.0001538 -0.0001489 0.0640603 1.7302356 -0.2259881 0.000186 -1.1474132 1.3873545 0.0000101 0.0007683 -0.0000488 0.1907394 -0.4451157 -0.0919209 -0.0000789 -0.206243 -0.0884089 -0.0000596 -0.0003299 -0.0000603 0.0575675 0.1847482 0.0380333 -0.0000278 0.007715 0.1163374 0.0001009 -0.0002153 0.000175 0.3199419 -0.0041875 0.009085 -0.0000172 -0.0097925 0.0985116 0.0002555 0.0001018 0.000189 0.2341777 -0.1279046 0.005103 0.0004668 0.1119511 0.0575196 -0.000171 0.0003214 0.000091 0.117689 0.0806204 -0.0055371 0.0522815 -0.03709 0.0029907 -0.0882509 0.0059577 -0.113233 -0.0289328 0.0804934 -0.0049361 -0.0526962 -0.0366826 0.0033757 0.0882802 -0.0062343 0.1131689 -0.0286602 0.0558143 -0.0010485 -0.021317 -0.0337056 0.0381933 0.1079737 0.0302362 0.1069986 -0.0285728 0.007406 0.0532394 -0.0000053 0.114525 0.0102689 -0.0000037 0.0000108 0.0000012 0.1332778 0.0557175 -0.0010421 0.0213217 -0.0336389 0.0382398 -0.1079377 -0.0301662 -0.1069637 -0.0285848 unknown
polarizability: 142.4953352|-3.6317148|110.868496|0.008702|-0.0784001|48.7218046 unknown
InChI: InChI=1S/C6H8N2OS/c1-4-3-10-6(7-4)8-5(2)9/h3,8H,1-2H3
charge 0 multiplicity 1
18 atoms
S  -1.141872 2.067228 -0.004021
O  2.101541 -1.511544 -0.000733
N  1.318079 0.71771 -0.000963
N  -0.735257 -0.595027 0.000858
C  -2.131635 -0.393684 0.00017
C  -0.067385 0.535619 -0.000955
C  -2.540116 0.929765 -0.002101
C  -3.03159 -1.600447 0.001802
C  2.331989 -0.28043 -0.000884
C  3.73655 0.328964 -0.000667
H  1.643883 1.686825 -0.001246
H  -3.55428 1.322592 -0.002798
H  -4.094526 -1.308267 0.003642
H  -2.836086 -2.225514 -0.887819
H  -2.832835 -2.225396 0.890753
H  3.900685 0.956165 -0.896785
H  4.472097 -0.487477 -0.000646
H  3.900457 0.956017 0.895595
