program: Gaussian 09
title: 000280916
version: EM64L-G09RevD.01
frameworkgroup: C1[X(C13H15Cl)]
method: RPBEPBE
basis: SDD
operation: Freq
keyword: #p
keyword: freq=noraman
keyword: PBEPBE/SDD
title: #p freq=noraman PBEPBE/SDD
converged: YES YES NO NO
title: Mulliken charges:
elementType: Cl C C C C C C C C C C C C C H H H H H H H H H H H H H H H
charge: -0.102159 -0.176022 -0.175225 -0.270073 -0.423329 -0.447429 -0.437999 -0.380940 0.567796 -0.404707 -0.400558 -0.228064 -0.228731 -0.236136 0.241174 0.244958 0.199992 0.212575 0.221312 0.207841 0.207214 0.228167 0.203144 0.199647 0.245921 0.246630 0.227529 0.227604 0.229869
chargesum: 0.00000
title: Mulliken charges with hydrogens summed into heavy atoms:
elementType: Cl C C C C C C C C C C C C C
charge: -0.102159 0.065152 0.069733 -0.270073 -0.010762 -0.018276 -0.002619 0.021851 0.567796 -0.158787 -0.153928 -0.000535 -0.001127 -0.006268
polarizability: 1.85050617e+02 -5.13579797e-01 1.33940474e+02 5.72892498e+00 2.81033564e+00 1.02465408e+02
1716.lowfreq: -7.2327 -0.0024 -0.0022 -0.0013 7.8384 11.6322 31.7875 77.6910 85.1665
frequency: 31.1722 77.6403 85.0306 127.1035 148.0790 186.6411 253.0023 269.1405 283.5076 317.8852 402.6073 416.2212 437.8592 462.9850 512.4899 527.2140 612.6673 615.7785 648.3828 701.7654 737.2805 764.2624 789.1918 808.5747 832.3238 842.5763 854.9422 914.9781 928.1101 957.2933 969.4851 980.2965 982.4245 992.8424 998.5483 1020.6104 1035.0823 1044.5431 1081.3084 1099.8395 1113.5269 1142.0850 1160.8879 1171.9911 1172.5015 1183.0579 1219.3308 1258.9349 1265.4094 1273.8639 1309.5842 1318.3478 1331.8804 1337.9009 1348.4867 1351.4614 1377.6589 1411.2074 1434.2711 1458.8741 1465.1425 1466.6397 1477.4370 1486.8143 1588.7201 1610.8912 2971.2387 2973.2661 2984.2229 2994.4033 3023.6955 3034.7522 3044.7160 3059.8509 3086.9073 3104.9478 3123.2812 3128.6447 3139.9016 3149.7123 3164.8639
redmass: 3.9576 4.3384 4.0017 2.9228 5.0118 3.8666 4.0731 4.7362 2.7824 2.0145 2.8029 3.3369 3.1392 3.8221 3.2700 3.4449 4.9831 5.4675 2.4305 1.7352 3.7111 1.9678 1.7202 2.4258 2.6857 2.4983 1.2645 1.7010 1.4410 3.1636 2.5271 1.4135 2.8178 3.8568 1.4528 1.9738 1.5607 1.3626 1.5614 1.7252 1.8723 1.6280 1.6697 1.0953 1.2480 1.1112 2.0526 1.4774 1.2956 1.2812 1.3460 1.3028 1.4300 1.4158 1.4328 1.4911 8.1254 2.9104 2.2231 1.1075 1.0863 1.0889 1.0859 2.5682 6.1781 6.1350 1.0615 1.0599 1.0621 1.0629 1.1010 1.0969 1.1025 1.1023 1.0875 1.0909 1.0846 1.0877 1.0923 1.0968 1.1017
irintensity: 0.0494 0.6090 0.1256 0.3380 1.2075 1.7803 1.2352 2.2884 0.1245 0.4445 0.0245 6.5163 3.0102 3.1670 4.5927 9.3912 12.7929 17.8120 4.4122 52.2870 10.4195 58.6183 3.4610 7.6177 4.0860 8.9850 0.1670 3.3713 2.0117 2.5713 3.7482 0.0750 2.1424 0.5286 0.2658 14.5556 0.6876 5.1144 8.8569 1.5521 2.5478 1.5899 0.3639 0.6256 2.4405 1.5430 7.9113 6.2734 0.3928 0.9610 2.3374 0.1184 0.8069 3.8228 5.0948 0.5002 0.2122 17.1800 9.4002 7.9764 8.4322 7.1586 13.3336 4.9853 0.7507 0.4525 40.7558 33.9034 28.3495 60.7134 20.8647 66.2183 17.1605 56.4697 11.2528 30.4546 2.4508 0.0701 16.7336 37.1657 22.6113
temp: 298.150 k
press: 1.00000 atm
elementType: 17 6 6 6 6 6 6 6 6 6 6 6 6 6 1 1 1 1 1 1 1 1 1 1 1 1 1 1 1
symmnumber: 1
zpe: 636850.0 jmol-1
zpe.correction: 0.242563 hartree
zpe.thermalcorrener: 0.254929 hartree
zpe.thermalcorrenthalpy: 0.255873 hartree
zpe.thermalcorrgfe: 0.203159 hartree
zpe.sumelectzpe: -963.384734 hartree
zpe.sumelectthermal: -963.372369 hartree
zpe.sumelectthermalent: -963.371425 hartree
zpe.sumelectthermalfe: -963.424139 hartree
dipole: -0.3086 0.1505 -2.1118
dipole: 2.1395
quadrupole: -81.5117 -84.0660 -95.6911
quadrupole: -0.1060 -0.0611 1.2881
quadrupole: 5.5779 3.0236 -8.6015 -0.1060 -0.0611 1.2881
hfenergy: -963.6272977 hartree
pointgroup: C01 [X(C13H15Cl1)]
dipole: -0.1013646 -0.0646979 0.8331294 debye
polarizability: 184.7262078|0.8150194|133.9101882|-7.6930008|2.9604814|102.8201025 unknown
InChI: InChI=1S/C13H15Cl/c14-13(10-6-2-1-3-7-10)11-8-4-5-9-12(11)13/h1-3,6-7,11-12H,4-5,8-9H2
charge 0 multiplicity 1
29 atoms
Cl 0.701174 0.190766 -2.085705
C  1.190303 0.702702 0.760703
C  1.19436 -0.851916 0.621497
C  0.271116 0.0150 -0.244538
C  2.445608 1.506971 0.405333
C  2.4515 -1.545519 0.082206
C  3.585535 0.7010 -0.276841
C  3.732357 -0.710653 0.330902
C  -1.218207 -0.004187 -0.066117
C  -1.933774 1.201902 0.144013
C  -1.932208 -1.227746 -0.130954
C  -3.337676 1.185214 0.293788
C  -3.335993 -1.246751 0.017103
C  -4.042718 -0.03961 0.229648
H  0.646211 1.103924 1.626539
H  0.658891 -1.406228 1.402677
H  2.837006 1.921245 1.355913
H  2.166542 2.37217 -0.227982
H  2.343725 -1.719353 -1.006345
H  2.545716 -2.537693 0.561017
H  4.530874 1.266484 -0.167553
H  3.386328 0.60492 -1.35984
H  4.603371 -1.227846 -0.115565
H  3.92184 -0.631765 1.420938
H  -1.384952 2.149865 0.185693
H  -1.381271 -2.159923 -0.301683
H  -3.881895 2.122165 0.457001
H  -3.879209 -2.196959 -0.03497
H  -5.132455 -0.053379 0.344319
