program: Gaussian 09
title: 000280911
version: EM64L-G09RevD.01
frameworkgroup: C1[X(C6H14N8O2)]
method: RPBEPBE
basis: SDD
operation: Freq
keyword: #p
keyword: freq=noraman
keyword: PBEPBE/SDD
title: #p freq=noraman PBEPBE/SDD
converged: YES YES NO NO
title: Mulliken charges:
elementType: O O N N N N N N N N C C C C C C H H H H H H H H H H H H H H
charge: -0.470115 -0.471047 -0.131769 -0.211286 -0.265031 -0.143114 -0.621897 -0.624040 -0.620742 -0.621963 -0.201582 -0.312920 0.109834 -0.305457 0.333553 0.273999 0.236919 0.173128 0.221688 0.253101 0.356231 0.366538 0.351403 0.315703 0.312752 0.370476 0.312045 0.337589 0.313601 0.362401
chargesum: 0.00000
title: Mulliken charges with hydrogens summed into heavy atoms:
elementType: O O N N N N N N N N C C C C C C
charge: -0.113884 -0.104509 -0.131769 -0.211286 -0.265031 -0.143114 0.045208 0.059188 0.028892 0.054040 0.035337 0.081897 0.109834 -0.052356 0.333553 0.273999
polarizability: 3.64675998e+02 -1.72167809e+01 1.35747717e+02 3.45665251e+00 3.27657912e+00 6.92948010e+01
1716.lowfreq: -4.9681 -0.0007 -0.0006 -0.0002 1.1528 7.1770 30.8258 42.1881 58.2357
frequency: 30.7666 42.1795 58.2296 63.7763 73.8569 110.6925 122.1498 142.0847 176.3002 217.2177 234.4607 242.2114 253.0011 261.2513 277.3024 305.6315 355.6099 382.9270 413.8209 416.9980 431.1274 435.0864 451.2948 480.0903 510.3729 516.9217 534.4252 578.2235 602.4447 624.1616 650.2102 658.4929 681.4417 721.0565 724.4529 737.6990 739.9714 783.0456 935.2913 938.6248 950.0185 988.6530 1000.1007 1011.5039 1017.8835 1026.5840 1047.6279 1056.5368 1057.9596 1132.1950 1146.9096 1179.1478 1266.8071 1285.9724 1292.3909 1331.4058 1352.7035 1476.0986 1487.8672 1494.9960 1499.8170 1512.8021 1514.4992 1517.8189 1559.1084 1577.3013 1597.8189 1608.1494 1628.9581 1637.4360 2931.5239 2977.4406 3003.8163 3023.9374 3051.5442 3082.0689 3469.6063 3525.4066 3550.8737 3555.9994 3676.0120 3680.7937 3700.1202 3706.6205
redmass: 7.0668 4.7876 4.4861 5.2706 4.6808 4.9745 4.8929 3.1691 1.3885 4.2331 2.2210 5.2620 1.7035 4.4664 4.0206 2.2862 3.8613 4.3753 2.2062 2.4147 2.2364 1.4746 2.9218 2.2940 1.2279 2.7929 1.4259 4.4155 2.3601 1.7919 3.0411 3.2864 3.9533 1.2270 1.1651 5.4752 1.3073 2.9768 1.6571 3.3766 4.3375 2.5906 5.4776 1.9677 3.0191 1.9361 1.9758 2.3875 2.4117 3.2107 3.7808 1.1046 1.5332 1.1990 1.2875 1.2473 3.5273 1.4363 1.9278 2.4353 1.6537 3.7952 1.4158 1.4258 2.6309 2.4795 2.1747 1.4827 1.4124 1.5614 1.0671 1.0788 1.0757 1.0746 1.0917 1.0897 1.0506 1.0460 1.0451 1.0460 1.1028 1.0979 1.1041 1.1044
irintensity: 4.3193 12.1002 2.6533 1.0866 2.1703 0.4373 2.9837 2.9768 27.4445 8.9727 7.6703 14.3816 138.6806 13.2146 3.1936 71.3990 17.7601 3.0806 119.6455 27.3945 182.7969 303.9932 12.7191 24.5780 68.1493 35.0615 96.2388 23.5136 59.7749 112.5954 13.0651 42.6924 101.4853 32.2569 14.4866 4.2743 261.1041 13.9268 38.2654 47.9839 57.8396 47.1116 37.6264 6.4329 22.9765 12.5277 8.4873 8.9715 29.6016 223.3287 36.5007 11.8608 22.4465 6.4940 4.6902 4.1659 6.6559 129.7597 320.2604 34.1232 139.3205 931.8468 43.8103 19.3302 826.7386 184.5332 546.2633 188.4753 992.6046 16.9662 117.3912 111.8534 104.8849 661.1686 27.4929 2.8160 38.3377 42.3339 126.5704 133.8859 69.8073 96.0388 34.7135 48.9116
temp: 298.150 k
press: 1.00000 atm
elementType: 8 8 7 7 7 7 7 7 7 7 6 6 6 6 6 6 1 1 1 1 1 1 1 1 1 1 1 1 1 1
symmnumber: 1
zpe: 616721.2 jmol-1
zpe.correction: 0.234897 hartree
zpe.thermalcorrener: 0.252771 hartree
zpe.thermalcorrenthalpy: 0.253715 hartree
zpe.thermalcorrgfe: 0.188674 hartree
zpe.sumelectzpe: -824.201769 hartree
zpe.sumelectthermal: -824.183895 hartree
zpe.sumelectthermalent: -824.182951 hartree
zpe.sumelectthermalfe: -824.247991 hartree
dipole: -0.8040 -5.6229 -0.8400
dipole: 5.7418
quadrupole: -15.6188 -95.2316 -104.7369
quadrupole: -19.1506 6.6945 2.3121
quadrupole: 56.2436 -23.3692 -32.8744 -19.1506 6.6945 2.3121
hfenergy: -824.4366655 hartree
pointgroup: C01 [X(C6H14N8O2)]
dipole: 0.4138807 2.1066499 0.7027571 debye
polarizability: 362.7049874|-27.7835021|127.4307738|-1.208672|24.3136457|79.5827547 unknown
InChI: InChI=1S/C6H14N8O2/c7-5(8)13-11-1-3(4(16)2-15)12-14-6(9)10/h1,4,15-16H,2,7-10H2
charge 0 multiplicity 1
30 atoms
O  0.722769 -2.152054 0.15826
O  -2.312256 -1.571758 -1.93539
N  -1.553954 0.824078 0.323706
N  1.954071 0.16255 0.247855
N  -2.788473 0.211374 0.033179
N  3.081977 0.970352 0.45843
N  -5.092142 0.570823 0.04483
N  -3.640282 2.326521 0.739117
N  5.409216 0.953128 0.48192
N  4.297829 -0.917158 -0.450862
C  -0.518877 -1.449192 -0.172073
C  -0.884892 -1.720095 -1.667308
C  -0.47112 0.05192 0.1829
C  0.781052 0.767616 0.387408
C  -3.822356 1.049067 0.277917
C  4.223505 0.317336 0.15962
H  -1.326427 -1.90275 0.438568
H  -0.281386 -1.061505 -2.330755
H  -0.60891 -2.770756 -1.868474
H  0.721513 1.837104 0.639477
H  1.4511 -1.443586 0.228128
H  -2.675215 -0.924937 -1.237008
H  -5.177385 -0.384598 -0.296104
H  -5.911602 1.17001 0.063081
H  -4.395978 2.954739 0.991695
H  -2.656005 2.580382 0.870933
H  6.283601 0.71848 0.019823
H  5.323426 1.847037 0.960904
H  5.147008 -1.475523 -0.435785
H  3.413996 -1.361801 -0.700189
