program: Gaussian 09
title: 000280988
version: EM64L-G09RevD.01
frameworkgroup: C1[X(C17H17F3N2O8)]
method: RPBEPBE
basis: SDD
operation: Freq
keyword: #p
keyword: freq=noraman
keyword: PBEPBE/SDD
title: #p freq=noraman PBEPBE/SDD
converged: YES YES NO NO
title: Mulliken charges:
elementType: F F F O O O O O O O O N N C C C C C C C C C C C C C C C C C H H H H H H H H H H H H H H H H H
charge: -0.139006 -0.133214 -0.177586 -0.211073 -0.273710 -0.244890 -0.258783 -0.197632 -0.241938 -0.198503 -0.198842 -0.381092 0.028143 -0.148562 -0.135831 -0.085890 -0.136111 0.322469 -0.341601 -0.691751 -0.665749 0.156189 0.302537 0.201461 0.231485 -0.319494 -0.306727 -0.350667 -0.343346 0.388921 0.269083 0.306376 0.247100 0.294884 0.278996 0.245717 0.363898 0.233075 0.229980 0.230617 0.234627 0.226306 0.235334 0.281775 0.288882 0.292685 0.291458
chargesum: 0.00000
title: Mulliken charges with hydrogens summed into heavy atoms:
elementType: F F F O O O O O O O O N N C C C C C C C C C C C C C C C C C
charge: -0.139006 -0.133214 -0.177586 -0.211073 -0.273710 -0.244890 -0.258783 -0.197632 -0.241938 -0.198503 -0.198842 -0.017193 0.028143 0.120521 0.170546 0.161209 0.158773 0.322469 0.183111 0.001922 0.030518 0.156189 0.302537 0.201461 0.231485 -0.037719 -0.017845 -0.057981 -0.051889 0.388921
polarizability: 3.09206937e+02 9.92194113e+00 2.33956322e+02 -2.81245954e+01 2.02819032e+01 1.59013249e+02
1716.lowfreq: -12.6418 -5.3769 -3.8068 0.0005 0.0007 0.0009 2.7818 9.0585 13.8285
frequency: -11.7355 8.8517 13.6276 19.4628 29.5725 34.6844 40.7558 52.6612 60.0806 66.8563 80.9808 91.2178 112.0011 118.0960 122.4679 164.0102 183.8802 196.5383 204.8764 210.9660 240.7090 253.0264 265.7282 274.1965 289.9416 296.2031 308.3713 329.8068 355.3806 373.3564 384.0125 409.2073 429.9492 447.6250 458.7857 461.0715 476.9294 479.0008 488.8209 516.8856 527.1175 550.9496 598.2127 622.1657 623.0753 636.5116 651.4687 653.5169 678.9596 686.9884 712.2415 729.4373 749.0483 754.9104 765.5394 766.8949 788.0870 804.3395 812.7614 839.0929 852.6059 864.8694 889.0206 902.1929 920.2061 923.6810 939.8710 955.8881 983.1438 986.2750 1002.6177 1005.5585 1005.9748 1011.1841 1011.6549 1032.1862 1039.8926 1045.1370 1061.2100 1071.9866 1089.0698 1107.5365 1110.2412 1138.1745 1141.4863 1178.1161 1187.1423 1195.5175 1214.0468 1230.6755 1235.1481 1247.3658 1255.4615 1265.3433 1274.2230 1283.0507 1294.8228 1297.7684 1315.5822 1339.5211 1352.3259 1368.9571 1382.0483 1385.0499 1398.1343 1405.1151 1415.4731 1427.0176 1449.2750 1453.5488 1470.0539 1473.1063 1474.9281 1488.6579 1590.0486 1609.4134 1622.4179 1652.3297 2997.2930 3012.3263 3031.6253 3041.2232 3067.3158 3075.5209 3078.8035 3096.0965 3105.0703 3115.1162 3120.2544 3159.2808 3164.8767 3177.3727 3188.7671 3194.5414 3519.2952
redmass: 15.7939 8.3213 7.2885 6.9712 10.8124 5.8765 4.9268 7.5764 6.8993 6.2868 7.6371 7.9256 2.5708 1.6789 3.3711 5.0598 3.6517 1.5462 8.6129 4.2967 6.1959 4.8205 8.1555 9.5848 3.7809 6.3190 3.1190 7.1800 3.7759 6.8373 5.1030 2.8825 5.4856 8.8428 4.2983 4.1066 5.8785 5.1253 6.5500 6.4297 5.5436 5.4068 4.8445 5.1565 6.8917 6.4745 1.3839 5.7083 7.2529 4.0564 10.1401 6.0176 6.4503 7.7486 5.0197 4.6325 5.1944 6.1508 5.4086 3.3964 4.6242 1.2413 1.6782 4.3760 5.2622 1.8700 2.5645 2.7582 2.4323 1.5419 5.1259 2.8907 1.4298 5.7138 1.3970 5.3715 10.5899 3.5641 2.2088 3.9862 3.2682 4.0111 1.3327 2.5998 3.1280 1.2450 1.9366 2.4795 6.5719 1.4715 1.7546 4.4951 1.2038 1.5344 2.1279 1.4832 1.2610 1.4605 1.1548 1.3095 1.3369 7.8137 1.2974 1.3509 1.2387 7.9857 4.5221 1.0981 1.0493 1.0491 1.0620 1.0590 2.3932 1.9023 8.7620 6.4587 9.7842 10.9716 1.0357 1.0361 1.0655 1.0871 1.0871 1.0858 1.0900 1.0997 1.1006 1.0997 1.1001 1.0985 1.0903 1.0893 1.0958 1.0975 1.0781
irintensity: 1.1216 0.1574 0.0158 0.1495 3.2862 0.6135 0.8185 0.2624 1.7656 1.4465 1.2559 4.7085 0.5345 1.8990 3.8633 4.2942 2.5370 0.4888 2.4616 0.7893 8.8545 5.0696 1.1186 4.1477 7.0285 9.0035 1.8863 8.8960 13.7121 2.0522 3.6156 0.0237 9.2579 6.1295 1.1770 21.2841 12.7801 5.2265 2.3977 7.6588 17.6080 6.0260 6.4269 17.5235 1.6001 16.1066 106.9636 1.7155 3.2303 55.1493 8.0089 20.0169 6.6938 22.4846 13.5776 34.0309 32.2919 11.5888 1.2347 32.6240 1.8616 0.2041 51.5225 172.5978 18.5791 59.7293 96.6391 26.1176 33.3861 1.5546 88.0997 73.1540 6.4766 150.3633 3.7330 40.3221 196.9515 123.5028 163.0437 127.8950 11.6919 30.2278 18.0234 167.0909 63.5976 3.2892 10.2204 149.1643 482.6860 9.5046 31.2610 200.6391 18.5610 13.1961 26.5122 10.9951 0.6642 8.2029 4.9321 2.9639 7.8117 85.7174 36.1833 8.4032 32.5631 11.5177 66.3834 16.5113 2.3962 4.8330 4.8810 12.2222 3.9024 175.4929 45.7962 6.3273 109.3384 289.2679 9.0313 6.9562 13.2941 19.2010 10.1498 11.5807 20.4505 29.7516 2.8187 17.7269 31.5444 0.6981 1.2070 1.1638 0.8247 0.4756 54.3485
temp: 298.150 k
press: 1.00000 atm
elementType: 9 9 9 8 8 8 8 8 8 8 8 7 7 6 6 6 6 6 6 6 6 6 6 6 6 6 6 6 6 6 1 1 1 1 1 1 1 1 1 1 1 1 1 1 1 1 1
symmnumber: 1
zpe: 877879.8 jmol-1
zpe.correction: 0.334367 hartree
zpe.thermalcorrener: 0.361969 hartree
zpe.thermalcorrenthalpy: 0.362913 hartree
zpe.thermalcorrgfe: 0.270730 hartree
zpe.sumelectzpe: -1666.509441 hartree
zpe.sumelectthermal: -1666.481839 hartree
zpe.sumelectthermalent: -1666.480895 hartree
zpe.sumelectthermalfe: -1666.573077 hartree
dipole: 2.9231 4.4250 0.4631
dipole: 5.3235
quadrupole: -238.4355 -164.8106 -177.0083
quadrupole: 17.4586 21.1029 -3.1731
quadrupole: -45.0174 28.6076 16.4098 17.4586 21.1029 -3.1731
hfenergy: -1666.8438075 hartree
pointgroup: C01 [X(C17H17F3N2O8)]
dipole: -0.8956231 1.5356199 1.1074183 debye
polarizability: 303.1402546|6.9218294|220.8098231|-39.6303429|35.9074275|178.2264311 unknown
InChI: InChI=1S/C17H17F3N2O8/c1-16(2)29-12-11(21-15(24)17(18,19)20)10(28-14(12)30-16)7-27-13(23)8-3-5-9(6-4-8)22(25)26/h3-6,10-12,14,21H,7H2,1-2H3
charge 0 multiplicity 1
47 atoms
F  -6.531743 -0.80717 -2.185638
F  -5.449134 -2.793828 -2.324535
F  -4.568882 -0.949745 -3.323337
O  -0.889246 1.423686 -0.955177
O  -2.437091 1.583779 1.971673
O  -1.029709 3.068087 0.829814
O  1.388055 -0.1220 0.283561
O  -4.984118 -1.442825 0.261758
O  1.187291 -2.314566 -0.490718
O  7.849444 -1.750671 -2.774856
O  7.875457 0.433813 -2.118386
N  -3.334264 -0.403083 -1.040971
N  7.295886 -0.711661 -2.246974
C  -2.795937 1.442831 0.551702
C  -2.485808 -0.0091 0.095078
C  -1.755621 2.33268 -0.21654
C  -1.004167 0.061575 -0.359289
C  -1.788817 2.918232 2.106155
C  -0.007667 -0.189213 0.783337
C  -0.807993 2.870577 3.269279
C  -2.845197 4.026621 2.22844
C  -4.50846 -1.086369 -0.846177
C  -5.265996 -1.414391 -2.165057
C  1.869783 -1.269099 -0.351838
C  3.274757 -1.090055 -0.826932
C  3.924695 -2.20626 -1.415339
C  3.949148 0.153436 -0.710287
C  5.245858 -2.090114 -1.883131
C  5.270904 0.282745 -1.176145
C  5.897039 -0.843543 -1.753647
H  -3.849663 1.718463 0.374313
H  -2.675157 -0.708032 0.926805
H  -2.150996 3.046188 -0.956102
H  -0.793514 -0.641999 -1.181893
H  -0.064319 0.590143 1.552677
H  -0.187983 -1.190093 1.216669
H  -3.041553 -0.146847 -1.988751
H  -0.049113 2.088332 3.110755
H  -1.347614 2.660696 4.207893
H  -0.293934 3.841308 3.365174
H  -3.416064 3.904427 3.164633
H  -3.55411 4.002237 1.382328
H  -2.351668 5.013126 2.235503
H  3.378599 -3.151123 -1.496207
H  3.429551 1.003653 -0.261927
H  5.774846 -2.930291 -2.339592
H  5.819021 1.225346 -1.103903
