program: Gaussian 09
title: 000280868
version: EM64L-G09RevD.01
frameworkgroup: C1[X(C20H15N)]
method: RPBEPBE
basis: SDD
operation: Freq
keyword: #pfreq=noraman
keyword: PBEPBE/SDD
title: #p freq=noraman PBEPBE/SDD
converged: YES YES NO YES
title: Mulliken charges:
elementType: N C C C C C C C C C C C C C C C C C C C C H H H H H H H H H H H H H H H
charge: -0.477961 0.174172 -0.539248 -0.567714 0.040392 0.191361 0.281752 0.170073 0.195518 0.206482 -0.448247 0.413879 -0.502764 -0.428361 -0.367153 -0.396005 -0.434876 -0.253305 -0.224778 -0.258547 -0.252520 0.220267 0.226405 0.216426 0.235251 0.307570 0.212613 0.236738 0.232865 0.230218 0.225168 0.240248 0.219450 0.220378 0.225801 0.228449
chargesum: 0.00000
title: Mulliken charges with hydrogens summed into heavy atoms:
elementType: N C C C C C C C C C C C C C C C C C C C C
charge: -0.170391 0.174172 -0.092576 -0.116037 0.040392 0.191361 0.281752 0.170073 0.195518 0.206482 -0.235634 0.413879 -0.266025 -0.195495 -0.136935 -0.170837 -0.194628 -0.033855 -0.004400 -0.032746 -0.024071
polarizability: 4.59435771e+02 2.78533219e+00 2.20159694e+02 6.23705690e-02 -1.64652305e-01 9.39817200e+01
1716.lowfreq: -3.4622 -0.0003 -0.0002 0.0005 2.5634 8.3057 36.6486 73.3307 98.7135
frequency: 36.6428 73.3299 98.7096 130.5149 134.7928 190.0771 217.2108 241.3394 249.3772 269.6808 302.8935 356.5334 406.2751 423.3302 431.5943 438.7473 490.1910 495.6190 512.4271 524.3657 538.0459 552.6865 565.4777 575.8849 605.5139 620.9358 660.5609 694.0936 702.0473 720.2087 747.4969 757.1707 760.0875 776.6432 797.4075 825.7141 837.0197 847.8936 849.8449 878.0606 899.2644 907.3055 928.3188 950.9091 968.5578 969.4558 987.0459 988.9324 1010.3600 1024.3245 1027.1194 1032.1947 1091.1618 1122.4877 1154.1163 1162.8905 1169.7577 1175.5909 1186.9005 1200.5297 1218.5496 1237.0853 1242.1506 1254.7706 1267.9322 1307.8195 1322.2070 1327.6324 1366.8918 1372.0861 1401.2024 1406.1820 1410.9880 1429.7262 1437.8853 1447.1716 1457.5804 1464.2532 1484.7674 1493.2066 1512.7573 1560.5479 1579.1196 1586.9224 1605.5770 1626.8653 1631.0601 2947.8502 2956.6757 3030.3768 3056.6682 3113.1786 3120.2777 3122.6588 3130.0517 3131.8157 3141.1589 3144.0815 3150.7711 3161.9409 3164.8350 3613.1168
redmass: 5.3784 3.8501 4.6604 4.9880 3.1186 2.5247 3.9302 3.9131 6.2393 4.4062 3.5909 4.1339 3.1068 3.9077 3.4896 3.6149 1.7704 2.1870 4.9992 3.0997 3.6141 5.1544 5.3869 3.8187 3.5366 5.6389 5.1383 5.1901 2.9822 2.9329 1.4294 1.7892 2.3054 4.6174 2.7018 1.5534 4.2420 1.7320 2.9385 1.7499 3.3912 3.9457 1.3842 1.3506 1.3065 1.4121 2.5494 1.3893 2.0454 2.3922 3.6357 2.2235 2.7940 1.5961 1.4351 1.1610 1.1447 1.1154 1.5272 2.3116 1.4174 2.0317 1.7608 1.9168 1.5659 1.3215 2.6922 1.6813 2.8879 2.2178 3.9729 3.0511 3.0898 3.7945 2.7065 1.1488 3.1472 1.1660 3.5744 3.8887 3.7651 7.5170 6.7607 6.5685 6.3427 6.8810 6.9164 1.0707 1.0647 1.0933 1.0912 1.0862 1.0863 1.0848 1.0890 1.0885 1.0972 1.0952 1.0939 1.1001 1.0996 1.0801
irintensity: 0.1614 0.1197 0.2098 0.2331 0.9710 1.7253 4.7655 0.9361 0.1183 0.3035 3.0102 0.8147 2.0861 5.8947 11.2950 1.7889 37.4767 42.8507 9.6607 9.8356 6.0604 2.4231 0.4544 1.5270 0.2819 1.6531 6.1510 2.2600 1.8727 22.5054 69.3549 27.7119 48.2611 1.7509 1.4952 70.4089 1.9468 0.1452 0.4775 7.5019 1.2255 1.1725 2.7718 0.3527 0.1447 2.8491 2.9909 0.5087 10.4419 4.7561 0.6427 6.8269 5.6632 3.0373 1.1784 1.7044 0.9201 1.5398 2.3396 0.9133 8.7793 6.3670 15.7544 16.1183 8.8964 6.7647 68.5933 3.5860 14.2580 20.8965 38.4337 8.7565 5.9130 7.0860 8.2810 14.5743 3.6100 10.4846 0.4067 7.2744 12.1953 12.1932 5.9626 3.8915 26.5043 18.5588 0.7406 24.0556 38.8198 29.6084 28.1541 10.8496 4.7860 2.1588 1.9037 6.0328 27.6703 34.9570 35.0116 52.1904 38.0861 38.4448
temp: 298.150 k
press: 1.00000 atm
elementType: 7 6 6 6 6 6 6 6 6 6 6 6 6 6 6 6 6 6 6 6 6 1 1 1 1 1 1 1 1 1 1 1 1 1 1 1
symmnumber: 1
zpe: 758026.1 jmol-1
zpe.correction: 0.288717 hartree
zpe.thermalcorrener: 0.303773 hartree
zpe.thermalcorrenthalpy: 0.304717 hartree
zpe.thermalcorrgfe: 0.246873 hartree
zpe.sumelectzpe: -824.512896 hartree
zpe.sumelectthermal: -824.497840 hartree
zpe.sumelectthermalent: -824.496896 hartree
zpe.sumelectthermalfe: -824.554741 hartree
dipole: -0.9183 0.8832 -0.2922
dipole: 1.3071
quadrupole: -113.8496 -101.8189 -130.1783
quadrupole: 2.9355 -0.6952 -0.7960
quadrupole: 1.4326 13.4634 -14.8960 2.9355 -0.6952 -0.7960
hfenergy: -824.8016133 hartree
pointgroup: C01 [X(C20H15N1)]
dipole: 0.3625935 -0.3458183 -0.1158019 debye
polarizability: 459.4139288|3.5842341|220.1777559|0.4521732|0.6639461|93.9855003 unknown
InChI: InChI=1S/C20H15N/c1-2-6-14-13(5-1)9-10-17-15(14)11-12-18-16-7-3-4-8-19(16)21-20(17)18/h1-10,21H,11-12H2
charge 0 multiplicity 1
36 atoms
N  -1.931422 -1.435253 -0.187921
C  -1.585793 0.804167 0.121318
C  -0.753912 2.036506 0.370463
C  0.633505 1.888427 -0.313865
C  -0.9530 -0.433678 -0.0426
C  1.308299 0.532367 -0.087503
C  0.492714 -0.625051 0.002951
C  -3.009146 0.573675 0.081573
C  -3.199879 -0.845286 -0.126132
C  2.742192 0.390972 -0.052685
C  1.086585 -1.924556 0.144626
C  3.328839 -0.933075 0.088183
C  2.468372 -2.074497 0.186297
C  -4.153261 1.409904 0.193979
C  -4.481614 -1.425313 -0.234554
C  3.642937 1.50764 -0.168204
C  4.75379 -1.07999 0.122712
C  -5.433636 0.833232 0.091115
C  -5.596712 -0.568523 -0.122623
C  5.028312 1.333317 -0.136104
C  5.594977 0.028657 0.013902
H  -1.252063 2.946186 -0.013919
H  -0.618842 2.188632 1.46268
H  1.283386 2.713467 0.023642
H  0.498109 2.020584 -1.409244
H  -1.748333 -2.416098 -0.385065
H  0.444287 -2.808004 0.243208
H  2.917271 -3.068405 0.298021
H  -4.041609 2.487733 0.357335
H  -4.614409 -2.501135 -0.395511
H  3.241238 2.518282 -0.28753
H  5.174886 -2.086481 0.234826
H  -6.323655 1.466798 0.175197
H  -6.606803 -0.986296 -0.199467
H  5.689275 2.202659 -0.22588
H  6.683113 -0.094263 0.040778
