program: Gaussian 09
title: 000280850
version: EM64L-G09RevD.01
frameworkgroup: C1[X(C4H12NO2PS)]
method: RPBEPBE
basis: SDD
operation: Freq
keyword: #p
keyword: freq=noraman
keyword: PBEPBE/SDD
title: #p freq=noraman PBEPBE/SDD
converged: YES YES NO NO
title: Mulliken charges:
elementType: S P O O N C C C C H H H H H H H H H H H H
charge: -0.034501 1.017879 -0.487919 -0.580117 -0.464157 -0.555932 -0.571136 -0.833477 -0.488518 0.228207 0.247174 0.229910 0.228908 0.259093 0.233405 0.268689 0.263582 0.319809 0.244029 0.232370 0.242702
chargesum: 0.00000
title: Mulliken charges with hydrogens summed into heavy atoms:
elementType: S P O O N C C C C
charge: -0.034501 1.017879 -0.487919 -0.580117 -0.464157 0.149358 0.150270 0.018603 0.230582
polarizability: 1.24176849e+02 -3.80794151e+00 9.06227021e+01 -3.57428867e-01 -1.21045771e+00 8.92819372e+01
1716.lowfreq: -19.9826 -8.8589 -0.0023 -0.0022 0.0010 13.1781 48.9978 64.4454 90.4007
frequency: 48.9710 64.2070 90.3850 98.9559 118.3888 142.9713 147.1178 168.2687 189.5160 214.9861 221.6807 253.0369 267.0708 299.8733 311.9969 375.9766 403.9984 457.0558 608.9560 639.0094 655.2867 945.7695 964.8997 976.8893 1008.1291 1020.3289 1057.1685 1089.0532 1112.5968 1124.6505 1129.4686 1179.5764 1259.2116 1355.0585 1418.5065 1422.1220 1437.3134 1449.6480 1454.7314 1464.5674 1467.2430 1472.5924 1476.2014 1483.0817 1493.0202 2948.2575 2952.1353 2974.5267 2993.8160 3034.7927 3037.6507 3072.2532 3093.1282 3106.5050 3116.4134 3122.7914 3152.1649
redmass: 2.8633 2.8100 2.1671 1.1759 2.7317 3.9410 1.2789 2.6156 1.0619 3.6738 1.6110 5.1103 4.0040 7.3899 4.0738 3.4084 5.4730 7.2173 7.2352 7.9105 8.3176 3.1967 10.5505 1.1636 1.4087 4.8167 1.4083 1.2104 1.2460 1.3046 1.3372 5.3193 2.0778 1.1178 1.1196 1.1221 1.1420 1.0510 1.0489 1.0476 1.0527 1.0483 1.0497 1.0501 1.0512 1.0388 1.0395 1.0303 1.0325 1.0967 1.0976 1.1044 1.0987 1.0981 1.0987 1.1024 1.1069
irintensity: 3.2941 0.6088 4.2249 0.8692 2.8909 2.7186 1.2408 1.8018 0.0760 8.8918 1.9763 9.4693 17.7472 0.6488 20.2223 4.6791 8.2601 61.8725 119.2519 3.1627 95.6122 172.1562 97.4574 9.3383 26.5747 109.5843 7.9652 0.2616 0.1538 0.4927 0.2093 50.3461 8.1260 3.4511 9.1849 10.9240 2.3003 9.7419 13.9081 4.2214 8.5765 7.6081 46.5253 15.6434 2.6606 45.5888 128.9855 41.5543 31.3743 61.6012 4.8032 30.1838 8.3821 8.4903 3.7822 13.1568 11.3888
temp: 298.150 k
press: 1.00000 atm
elementType: 16 15 8 8 7 6 6 6 6 1 1 1 1 1 1 1 1 1 1 1 1
symmnumber: 1
zpe: 434507.4 jmol-1
zpe.correction: 0.165495 hartree
zpe.thermalcorrener: 0.179240 hartree
zpe.thermalcorrenthalpy: 0.180184 hartree
zpe.thermalcorrgfe: 0.125001 hartree
zpe.sumelectzpe: -1103.317918 hartree
zpe.sumelectthermal: -1103.304173 hartree
zpe.sumelectthermalent: -1103.303229 hartree
zpe.sumelectthermalfe: -1103.358412 hartree
dipole: -1.4414 -0.3845 -3.2663
dipole: 3.5908
quadrupole: -59.5981 -65.6092 -81.0260
quadrupole: 0.4598 2.0291 -2.2847
quadrupole: 9.1463 3.1353 -12.2816 0.4598 2.0291 -2.2847
hfenergy: -1103.4834131 hartree
pointgroup: C01 [X(C4H12N1O2P1S1)]
dipole: 0.6799449 0.0277608 1.2380472 debye
dipolederiv: -0.5010806 -0.0968446 0.1282201 -0.0980266 -0.3071579 0.0275966 0.1854503 0.1305048 -0.3602382 2.1601654 -0.0612439 -0.1276059 0.0984699 1.6824096 0.1521766 -0.1212939 -0.1903583 1.259481 -0.6366532 -0.0650738 0.0000551 -0.0740861 -1.1517393 -0.2654523 -0.019921 -0.2969777 -0.6407152 -0.7639 0.0163418 0.0021444 -0.0261585 -0.592978 -0.0395211 -0.0073249 0.0063593 -0.7583515 -1.1393973 0.1071557 0.0610943 -0.0167673 -0.8131575 0.0350541 0.0119992 0.0995771 -0.5260237 0.0321666 -0.0767569 0.0447251 -0.3441146 0.4601339 -0.0226516 0.0776791 -0.0239917 0.2581433 0.4877209 0.0712954 -0.0880576 0.2938938 0.1064066 0.0486893 -0.2435748 0.100263 0.2423015 0.2066717 0.06619 0.037472 0.0349966 0.0720745 -0.0014617 0.1763422 0.0260234 -0.086438 0.2667939 -0.0163277 0.0149391 -0.001261 0.3631314 0.0977304 0.0474967 0.4573088 0.3904383 0.0086631 0.1288752 0.0375031 0.1165473 -0.091636 -0.0403152 0.0992763 -0.1368945 -0.0527127 0.0215213 -0.1230512 0.0789232 -0.0659016 0.0697831 0.0105782 0.050823 0.0139491 0.0857842 -0.0427271 0.0682645 -0.1481464 0.024863 0.0272379 -0.0232946 -0.1453991 0.0212822 -0.0494195 -0.1251867 -0.0389266 -0.0677973 -0.0121155 0.1128922 -0.0013602 -0.1234204 -0.0219503 -0.0631983 0.1531589 0.0565237 -0.0272051 -0.0055443 -0.0574782 0.0538846 0.0139897 0.0527189 0.0885975 -0.0974852 -0.0082786 0.0840735 0.0819188 0.0157356 -0.1242068 0.1657035 -0.0769338 -0.0553901 -0.1278616 0.0509044 -0.026126 0.0641474 0.0144161 -0.020094 -0.0478701 -0.0221436 0.1034075 -0.0124877 -0.0893644 -0.0182701 -0.0909342 -0.0686224 0.0436986 -0.0332747 0.0429145 0.0945685 0.1194737 0.0106205 0.0381749 0.0124806 0.1242948 -0.0029254 -0.0475523 -0.0396847 0.0255704 0.1152166 -0.0380884 -0.0021892 -0.0186557 -0.1454314 0.0045999 -0.0002113 -0.0009302 0.0739239 -0.0583757 0.0212076 -0.1114577 0.0680668 0.0664808 0.0386337 -0.0981458 -0.0560234 -0.0348327 -0.066397 0.0165773 0.0895305 -0.0418186 0.1132041 0.028641 0.0592283 -0.0850129 0.0051039 unknown
polarizability: 120.0865728|11.2868462|94.4600201|-3.2425308|0.1081477|89.5348957 unknown
InChI: InChI=1S/C3H9NO2P.CH3S/c1-4(2)7(5)6-3;1-2/h1-3H3;1H3
charge 0 multiplicity 1
21 atoms
S  -1.699941 -0.452254 1.166855
P  -0.208736 0.164792 -0.493367
O  -0.087925 1.902107 -0.505118
O  -0.665166 -0.365082 -1.930154
N  1.328599 -0.275622 0.209842
C  1.540365 -1.655639 0.695989
C  2.555834 0.403097 -0.269429
C  -3.072672 -1.054569 0.006325
C  -0.099965 2.619374 0.787186
H  1.95743 -2.316769 -0.092034
H  0.588959 -2.082021 1.05497
H  2.248265 -1.628494 1.545097
H  3.271177 0.479652 0.570664
H  2.314452 1.41759 -0.624727
H  3.040458 -0.155986 -1.096754
H  -3.91969 -0.356869 0.062208
H  -3.364214 -2.062936 0.333957
H  -2.665237 -1.087806 -1.019848
H  -0.007458 3.682487 0.5190
H  0.747802 2.309061 1.426277
H  -1.051835 2.439389 1.319062
