program: Gaussian 09
title: 000280848
version: EM64L-G09RevD.01
frameworkgroup: C1[X(C4H12NO2PS)]
method: RPBEPBE
basis: SDD
operation: Freq
keyword: #p
keyword: freq=noraman
keyword: PBEPBE/SDD
title: #p freq=noraman PBEPBE/SDD
converged: YES YES NO NO
title: Mulliken charges:
elementType: S P O O N C C C C H H H H H H H H H H H H
charge: -0.244451 0.896173 -0.500825 -0.463392 -0.449702 -0.573834 -0.576580 -0.475485 -0.477704 0.234109 0.255562 0.230890 0.228479 0.268824 0.223280 0.235971 0.231557 0.247621 0.233253 0.241154 0.235102
chargesum: 0.00000
title: Mulliken charges with hydrogens summed into heavy atoms:
elementType: S P O O N C C C C
charge: -0.244451 0.896173 -0.500825 -0.463392 -0.449702 0.146727 0.144003 0.239664 0.231805
polarizability: 1.03768325e+02 -7.77529425e+00 1.00636589e+02 -4.72103444e+00 9.15555140e+00 9.07976926e+01
1716.lowfreq: -15.6012 -2.4799 -0.0030 -0.0016 0.0003 7.6611 45.3649 57.1266 65.3168
frequency: 45.3533 56.1817 64.6311 88.2904 91.7191 105.9260 145.3146 166.1741 188.2334 198.1215 206.5351 262.3258 299.4238 319.9614 358.0878 387.5363 396.9620 489.0024 651.0226 660.5247 682.6811 945.5879 949.9103 974.4969 1050.0070 1088.5679 1105.7178 1114.5435 1123.0800 1130.5224 1133.4441 1183.8854 1253.7683 1412.9904 1416.9095 1422.8240 1436.3851 1451.0999 1455.6362 1464.2168 1472.1014 1473.1863 1476.5661 1480.3663 1489.0383 2941.3201 2947.0993 2977.2260 2983.6201 3039.6365 3041.9048 3078.5033 3086.3188 3097.0794 3119.9189 3121.4975 3122.9761
redmass: 2.9739 2.4299 1.1473 2.1469 1.2086 3.0319 4.4114 3.7163 1.2694 2.1344 1.3909 6.3355 3.5066 3.3704 4.9271 4.0180 5.1649 5.5855 8.3919 10.5285 11.2222 4.6795 5.4715 8.2486 1.4543 1.2159 1.2404 1.2431 1.3039 1.3570 1.3204 4.7415 2.0422 1.1184 1.1253 1.1165 1.1440 1.0545 1.0515 1.0454 1.0507 1.0498 1.0505 1.0491 1.0508 1.0438 1.0418 1.0302 1.0287 1.0920 1.0935 1.1042 1.1049 1.0999 1.1031 1.0976 1.1039
irintensity: 1.1173 3.9040 0.1688 4.5402 1.0977 1.7728 1.5194 3.4748 2.6028 6.0860 2.1728 25.7946 12.6490 0.6652 2.4281 2.4859 4.5474 7.8001 93.3993 98.5180 153.3166 204.3338 177.4174 91.4462 9.7867 0.1458 0.2218 0.2323 0.6214 0.2200 1.0242 33.4077 4.1252 3.4259 12.0309 5.9404 2.5234 8.4610 12.8177 4.5550 0.2023 45.7081 1.1563 31.0112 8.3838 57.4773 100.4774 54.9391 50.2577 52.9458 7.5467 22.9572 33.9950 10.4841 17.6267 5.2718 15.3076
temp: 298.150 k
press: 1.00000 atm
elementType: 16 15 8 8 7 6 6 6 6 1 1 1 1 1 1 1 1 1 1 1 1
symmnumber: 1
zpe: 436194.1 jmol-1
zpe.correction: 0.166138 hartree
zpe.thermalcorrener: 0.179926 hartree
zpe.thermalcorrenthalpy: 0.180871 hartree
zpe.thermalcorrgfe: 0.124835 hartree
zpe.sumelectzpe: -1103.318338 hartree
zpe.sumelectthermal: -1103.304549 hartree
zpe.sumelectthermalent: -1103.303605 hartree
zpe.sumelectthermalfe: -1103.359641 hartree
dipole: -1.8192 1.9018 3.1476
dipole: 4.1029
quadrupole: -61.2988 -68.7169 -74.8813
quadrupole: 2.9362 4.7352 -3.6592
quadrupole: 7.0002 -0.4179 -6.5823 2.9362 4.7352 -3.6592
hfenergy: -1103.4844759 hartree
pointgroup: C01 [X(C4H12N1O2P1S1)]
dipole: -0.3334722 0.4504764 1.5137903 debye
dipolederiv: -0.5150765 0.0373018 0.0718656 0.0704207 -0.5373373 -0.2247286 0.0965295 -0.1673076 -0.6796282 1.8043294 0.0644621 -0.0539996 -0.0511033 1.8606488 0.5317754 -0.0292467 0.1001378 1.6186986 -1.1432876 0.2630114 -0.2854742 0.2830811 -0.6625954 0.0293363 -0.2977753 0.119984 -0.7516877 -0.5781125 -0.1268114 -0.0176604 -0.1326151 -1.2855006 -0.2887106 -0.0323962 -0.3228104 -0.5997975 -0.9371454 -0.0925074 0.0360811 -0.021467 -0.6997978 0.056894 0.0966315 0.1182792 -0.6721032 0.4114226 -0.0747779 0.0895859 -0.1457875 0.2048114 0.0702782 0.3501251 0.0368091 0.1136562 0.0875272 0.109198 -0.0745226 0.3462128 0.3360694 -0.1766738 -0.1629418 -0.0588597 0.3029522 0.7073991 -0.1529091 0.2010896 -0.2052031 0.3003149 -0.1465138 -0.1097034 0.0319535 0.1178401 0.2888743 0.0224677 0.0267502 0.0602542 0.4605459 0.0890125 0.1133124 0.4241991 0.343881 -0.0662769 -0.0089092 -0.0770027 -0.1303314 -0.0406585 -0.1056116 -0.1426386 -0.0498403 0.0199461 0.1113375 -0.0751934 0.047348 -0.0402085 0.0102268 0.0821823 -0.0022884 0.0878026 0.0277109 -0.0888807 0.0981941 0.0644913 0.0838702 0.0654023 -0.0642964 0.1000229 -0.0803145 -0.0039851 -0.0510127 0.0245468 0.1707229 0.0426944 0.0213731 -0.0462491 0.1367299 -0.0300097 -0.0199394 0.0448134 0.0629025 -0.1263214 0.0256374 0.0644629 0.0469392 -0.0827417 0.0364888 0.0775587 0.0069772 -0.1292437 0.0165638 -0.1604968 -0.1220329 0.0221912 -0.06561 -0.1005168 0.0059087 0.0169765 0.0564744 -0.046909 0.0497151 0.0648543 0.0907161 -0.0726244 0.1067397 -0.0631915 -0.1357371 -0.0418654 -0.002752 -0.1083571 -0.0282428 0.0445914 0.0698772 0.0322482 0.0916854 0.0565494 -0.028242 -0.031345 0.0299477 0.0027798 -0.0587451 0.0770139 -0.1466365 0.0542411 -0.0883089 -0.0237565 -0.1102523 0.0497191 0.0444032 0.0072024 -0.1103376 -0.0918237 -0.0007938 -0.0462029 0.0346825 0.1116256 -0.0202874 0.0891932 0.0023065 0.0748358 -0.0831901 -0.0208261 0.1138348 -0.0190253 -0.0098848 -0.0256955 -0.1489206 0.0381036 -0.0067742 0.0366674 0.0378735 unknown
polarizability: 97.3581996|-5.5805245|97.7387745|-2.8013374|13.0831964|100.1056318 unknown
InChI: InChI=1S/C4H12NO2PS/c1-5(2)8(9,6-3)7-4/h1-4H3
charge 0 multiplicity 1
21 atoms
S  0.437939 -1.369008 -2.125756
P  0.227336 -0.154331 -0.466845
O  1.217527 -0.554003 0.915044
O  0.612244 1.494043 -0.873087
N  -1.290815 0.025795 0.38484
C  -2.403395 0.594134 -0.413473
C  -1.696013 -1.011807 1.35939
C  2.49591 -1.259789 0.685458
C  0.729991 2.4795 0.230428
H  -2.933629 -0.177639 -1.010913
H  -2.018444 1.366216 -1.100294
H  -3.125165 1.067244 0.27688
H  -2.42782 -0.564151 2.056527
H  -0.818986 -1.3397 1.936787
H  -2.167054 -1.891782 0.870686
H  2.734649 -1.740058 1.646657
H  3.286599 -0.539519 0.410423
H  2.390184 -2.018378 -0.112391
H  1.660956 2.308762 0.798764
H  -0.138475 2.419545 0.910807
H  0.763063 3.456726 -0.275131
