program: Gaussian 09
title: 000280865
version: EM64L-G09RevD.01
frameworkgroup: C1[X(C15H13N5O3S)]
method: RPBEPBE
basis: SDD
operation: Freq
keyword: #p
keyword: freq=noraman
keyword: PBEPBE/SDD
title: #p freq=noraman PBEPBE/SDD
converged: YES YES NO NO
title: Mulliken charges:
elementType: S O O O N N N N N C C C C C C C C C C C C C C C H H H H H H H H H H H H H
charge: 0.868136 -0.239236 -0.513418 -0.573155 -0.394578 -0.045811 -0.394528 -0.637769 -0.616549 0.019542 0.219983 0.508871 0.033466 -0.039665 -0.102169 -0.419060 -0.347587 -0.297261 -0.198951 -0.245181 -0.325675 -0.282344 -0.181361 0.362781 0.352206 0.260276 0.278180 0.252272 0.284999 0.292795 0.265104 0.234939 0.233781 0.397398 0.320561 0.320499 0.348508
chargesum: 0.00000
title: Mulliken charges with hydrogens summed into heavy atoms:
elementType: S O O O N N N N N C C C C C C C C C C C C C C C
charge: 0.868136 -0.239236 -0.513418 -0.573155 -0.042372 -0.045811 -0.394528 0.080190 0.052459 0.019542 0.219983 0.508871 0.033466 -0.039665 -0.102169 -0.158784 -0.069407 -0.044989 0.086048 0.047613 -0.060571 -0.047405 0.052420 0.362781
polarizability: 4.54772649e+02 2.51467943e+01 2.65744527e+02 7.35359731e+00 1.42721011e+01 1.40162072e+02
1716.lowfreq: -5.4934 -1.3148 -0.0013 0.0013 0.0018 0.9474 12.7401 25.6344 33.6775
frequency: 12.6209 25.6201 33.6596 50.9541 53.6777 78.1491 112.7257 120.4815 135.9925 146.3264 160.2468 168.8169 234.8048 246.1253 266.6498 271.3219 278.6022 282.2263 320.1239 347.6299 359.6832 383.3510 390.8915 411.9081 424.6215 450.0942 474.3950 479.7245 489.1008 520.1644 531.7174 542.7631 549.0544 559.4772 597.0191 615.8934 618.9069 655.6241 674.9683 677.3934 706.7984 721.4818 733.9639 755.2809 763.6443 769.6104 806.1769 815.1280 833.5448 845.5656 868.4041 870.4934 878.5899 910.9495 939.5547 954.7263 969.2258 977.3655 980.9895 992.6709 995.9219 1005.2937 1059.5424 1062.9033 1084.6026 1103.5142 1110.1909 1118.0969 1148.9255 1178.0046 1186.1797 1233.0792 1275.5541 1289.6271 1297.2935 1344.2053 1380.5822 1404.3123 1407.0562 1448.1155 1477.3570 1487.9425 1510.7745 1512.8366 1517.0447 1585.5619 1593.6257 1606.5474 1609.0980 1633.8774 1640.7274 1660.0262 3133.3984 3144.1667 3146.5474 3157.3731 3168.1824 3170.4760 3177.5400 3184.2058 3221.6626 3273.4802 3538.9215 3625.6335 3688.3728
redmass: 6.5589 6.6535 5.9129 5.4637 4.6819 5.3401 6.9925 6.2247 7.4908 7.7102 8.2014 6.2189 7.3551 5.5847 6.7140 6.8854 6.7739 7.5789 3.8991 5.1806 1.8359 6.7269 2.7201 2.9854 3.5763 2.7379 6.7813 2.4021 2.3471 2.7815 2.0454 1.7236 4.0593 5.5643 7.2583 4.9069 6.8526 7.7754 8.2239 8.9997 5.4880 5.0037 4.0217 1.4785 6.7290 4.0733 3.9848 1.3144 1.3090 1.4301 5.6902 1.5218 1.5704 16.7375 3.3984 1.3664 1.4301 5.0594 1.4118 1.3713 4.0284 2.0991 2.3844 1.5839 3.4716 4.3863 1.6403 1.3419 1.6689 1.1688 1.2713 2.7749 2.7603 1.6670 1.4179 2.9275 3.8768 3.4847 3.4166 2.4914 2.4027 3.8933 2.8744 2.7463 3.8648 7.5759 6.2637 1.2794 5.0031 6.0230 1.3231 9.0725 1.0869 1.0902 1.0889 1.0905 1.0962 1.0962 1.0982 1.0954 1.0738 1.0655 1.0453 1.0883 1.1041
irintensity: 1.1346 1.5720 2.4986 7.2815 1.0499 3.5834 3.2630 2.5800 2.0454 2.6478 0.4196 11.0103 5.9952 2.1275 1.5597 13.1823 2.3815 7.5897 46.8399 7.3197 66.1956 2.1595 58.1263 10.2650 43.5601 46.7158 92.3572 126.3958 61.5054 33.0535 212.8431 85.4774 20.0549 22.4245 88.2466 15.5237 1.3298 11.5843 10.5618 21.3347 32.3431 1.6435 6.2305 65.0200 98.2543 10.7462 49.2290 200.1873 6.4641 10.6825 6.1170 10.0165 69.6043 99.4928 23.0959 3.0370 3.3115 17.7663 1.8531 1.3149 6.1355 3.2034 78.9887 1.5843 37.4903 126.7887 26.7353 18.9018 109.2980 6.6358 11.4818 155.6181 61.3579 98.8956 26.5168 14.9234 38.3864 260.4286 80.1056 55.5780 24.9502 166.0100 651.9583 5.8240 274.2420 86.2092 97.3468 220.1844 68.4696 311.2559 597.9370 400.2559 10.2236 2.5533 4.1622 2.8641 15.5207 3.5176 20.1864 4.1152 55.7510 190.6195 70.4393 87.6780 36.1656
temp: 298.150 k
press: 1.00000 atm
elementType: 16 8 8 8 7 7 7 7 7 6 6 6 6 6 6 6 6 6 6 6 6 6 6 6 1 1 1 1 1 1 1 1 1 1 1 1 1
symmnumber: 1
zpe: 696502.1 jmol-1
zpe.correction: 0.265284 hartree
zpe.thermalcorrener: 0.286907 hartree
zpe.thermalcorrenthalpy: 0.287851 hartree
zpe.thermalcorrgfe: 0.212399 hartree
zpe.sumelectzpe: -1475.011377 hartree
zpe.sumelectthermal: -1474.989753 hartree
zpe.sumelectthermalent: -1474.988809 hartree
zpe.sumelectthermalfe: -1475.064261 hartree
dipole: -7.5250 5.4962 -4.6654
dipole: 10.4211
quadrupole: -144.6328 -143.2131 -149.0577
quadrupole: 17.0561 37.1799 -4.0712
quadrupole: 1.0017 2.4214 -3.4231 17.0561 37.1799 -4.0712
hfenergy: -1475.2766602 hartree
pointgroup: C01 [X(C15H13N5O3S1)]
dipole: -3.1132605 -2.3895814 1.1863108 debye
polarizability: 452.9649964|-32.7167674|255.7834343|1.5742712|38.9411366|151.9308165 unknown
InChI: InChI=1S/C15H13N5O3S/c16-15(17)20-24(22,23)10-7-5-9(6-8-10)18-13-11-3-1-2-4-12(11)19-14(13)21/h1-8,18H,16-17H2
charge 0 multiplicity 1
37 atoms
S  -4.144228 0.422325 -0.94004
O  3.961597 2.552267 1.354352
O  -4.152643 -0.079165 -2.488114
O  -4.94252 1.822718 -0.544221
N  1.664796 1.281975 0.61251
N  5.208282 0.57288 0.74651
N  -4.594418 -0.941386 0.219343
N  -6.82666 0.041703 0.431693
N  -6.331329 -2.142354 1.171867
C  2.794906 0.567345 0.469671
C  3.244646 -0.705663 0.067035
C  0.316088 1.036433 0.24092
C  4.716817 -0.630243 0.263769
C  -2.350562 0.662559 -0.444635
C  4.098192 1.365996 0.919884
C  -0.700551 1.726702 0.954786
C  -0.016396 0.188183 -0.847283
C  2.632922 -1.928109 -0.366046
C  -2.052736 1.536054 0.613565
C  -1.367898 -0.002762 -1.194475
C  5.505807 -1.781274 -0.027757
C  3.440453 -3.036323 -0.624407
C  4.869683 -2.949838 -0.464513
C  -5.906947 -0.96892 0.574089
H  1.881156 2.201951 1.056569
H  -0.431703 2.396505 1.778987
H  0.771837 -0.270869 -1.448284
H  1.547041 -2.011844 -0.472247
H  -2.854711 2.064381 1.137657
H  -1.658766 -0.624578 -2.047233
H  6.589934 -1.730076 0.105409
H  2.992924 -3.98028 -0.950325
H  5.475834 -3.836033 -0.687745
H  -6.480919 0.961245 0.103785
H  -7.824595 -0.148796 0.492035
H  -7.10157 -2.142963 1.837828
H  -5.684063 -2.928147 1.16366
