program: Gaussian 09
title: 000280841
version: EM64L-G09RevD.01
frameworkgroup: C1[X(C8H12NOPS)]
method: RPBEPBE
basis: SDD
operation: Freq
keyword: #p
keyword: freq=noraman
keyword: PBEPBE/SDD
title: #p freq=noraman PBEPBE/SDD
converged: YES YES NO NO
title: Mulliken charges:
elementType: S P O N C C C C C C C C H H H H H H H H H H H H
charge: -0.024889 0.877596 -0.608799 -0.903775 -0.130549 -0.257784 -0.297250 -0.617296 -0.211662 -0.206197 -0.222621 -0.608101 0.270597 0.288021 0.312065 0.257524 0.348569 0.356224 0.235146 0.236304 0.234401 0.221303 0.233794 0.217378
chargesum: 0.00000
title: Mulliken charges with hydrogens summed into heavy atoms:
elementType: S P O N C C C C C C C C
charge: -0.024889 0.877596 -0.608799 -0.198982 -0.130549 0.012813 -0.009229 -0.047707 0.023484 0.030107 0.011779 0.064374
polarizability: 1.90480628e+02 -9.73151279e-01 1.27434973e+02 8.29471959e-01 -9.97128711e+00 9.94234521e+01
1716.lowfreq: 0.0010 0.0015 0.0016 5.2908 11.5113 13.9253 27.0166 39.7345 47.0198
frequency: 25.8509 39.6110 47.0069 71.8605 135.3535 165.7691 192.6358 195.9290 243.5379 248.7756 287.5940 318.9385 344.4788 366.8232 399.6516 409.2448 440.8110 501.4875 521.2599 592.3009 610.4402 681.8988 703.8369 765.2545 769.3940 808.7558 865.7325 943.3240 965.1941 984.0731 986.0308 990.1703 992.6197 1007.9517 1021.2255 1055.6684 1072.2823 1079.5491 1093.2631 1174.5500 1186.7012 1256.3997 1302.2777 1309.3740 1382.5250 1391.2379 1428.2850 1444.1061 1464.1605 1464.9864 1475.4817 1559.3673 1588.7539 1595.2753 2980.2265 2993.7936 3072.8191 3081.1323 3106.7763 3130.1459 3138.6911 3147.4337 3157.4671 3169.3522 3514.5502 3664.1814
redmass: 2.6883 3.4709 4.0808 6.7380 4.0152 2.6631 3.0657 2.7491 1.6163 5.1000 3.8494 4.0904 4.9210 1.6407 3.9320 2.6598 7.1799 3.0965 1.5433 5.1575 6.4108 6.3077 2.0273 1.5682 1.1483 5.5197 1.2417 1.3546 1.3448 1.9740 4.2008 1.9698 3.2351 1.3257 2.7852 1.4245 2.0315 1.6336 2.8431 1.0560 1.1246 1.2035 1.1730 1.3112 9.3112 1.2055 2.1197 1.0833 2.0567 1.0423 1.0463 1.1042 6.0444 5.8377 1.0368 1.0631 1.0970 1.1009 1.1025 1.0852 1.0879 1.0926 1.0968 1.1017 1.0448 1.1013
irintensity: 0.3311 0.9239 0.3587 1.1676 4.1157 7.1074 4.7938 3.7145 2.1497 4.0878 9.3295 2.9434 9.6454 29.5931 6.7160 6.6600 94.7021 95.6643 221.7875 5.7170 0.5720 7.2211 46.1445 67.0291 2.8228 116.5926 0.0920 6.3521 93.5156 40.6667 9.4705 10.8715 35.8342 0.3154 1.1621 0.4651 4.9456 1.7156 51.0318 0.0495 4.0416 14.3062 8.2944 3.0265 0.8730 15.3014 18.9719 6.5511 7.8738 15.2434 7.5721 75.6710 0.4153 0.2329 39.1145 19.3756 25.7814 5.1224 28.6666 0.1541 5.5248 4.3488 16.1842 29.9422 35.2154 28.3431
temp: 298.150 k
press: 1.00000 atm
elementType: 16 15 8 7 6 6 6 6 6 6 6 6 1 1 1 1 1 1 1 1 1 1 1 1
symmnumber: 1
zpe: 491220.4 jmol-1
zpe.correction: 0.187096 hartree
zpe.thermalcorrener: 0.200982 hartree
zpe.thermalcorrenthalpy: 0.201926 hartree
zpe.thermalcorrgfe: 0.144882 hartree
zpe.sumelectzpe: -1180.404948 hartree
zpe.sumelectthermal: -1180.391062 hartree
zpe.sumelectthermalent: -1180.390118 hartree
zpe.sumelectthermalfe: -1180.447162 hartree
dipole: -2.1639 1.6536 -0.3876
dipole: 2.7508
quadrupole: -73.3261 -80.4974 -91.3010
quadrupole: 0.7952 0.0122 7.3163
quadrupole: 8.3821 1.2108 -9.5928 0.7952 0.0122 7.3163
hfenergy: -1180.592044 hartree
pointgroup: C01 [X(C8H12N1O1P1S1)]
dipole: -0.8120004 -0.1771651 0.6932017 debye
dipolederiv: -0.6470106 -0.1950615 0.012252 -0.271502 -0.4896377 -0.0055052 0.0034633 -0.0495274 -0.2990663 2.0399034 0.1834706 0.0857013 0.3205606 1.6708842 -0.1820613 0.2779969 -0.1442033 1.1771692 -0.8290413 -0.0427666 0.0345149 -0.0676702 -0.6919782 -0.0568092 -0.073038 -0.0982045 -0.6740942 -0.8264602 0.0953634 0.065397 0.1234135 -0.9092536 0.1520877 0.0340258 0.1785727 -0.9084126 -0.2674204 0.0404723 -0.0020229 -0.0638869 -0.2798625 0.0169888 0.0428538 0.0196377 -0.1850714 -0.1224844 -0.0255357 0.1290933 -0.0079569 -0.096743 -0.0042842 -0.1336232 0.006142 0.0055408 -0.127136 -0.0315411 -0.1381808 -0.0301703 -0.1034357 0.0249668 0.1556649 0.0086772 -0.0027404 0.3551404 0.0901715 -0.1645637 0.0785854 0.1316615 -0.0767766 -0.3585238 -0.2342497 0.1293401 -0.0707887 -0.01718 -0.1481431 0.0031155 -0.1273083 0.0395211 -0.0957787 0.0291545 0.0584666 -0.0604239 -0.0062113 0.1534742 0.0225293 -0.1310637 -0.0122302 0.0880092 0.0065987 0.0775743 0.1115169 -0.0546672 0.002664 -0.0468609 -0.1314155 0.0079779 0.0134715 0.0033131 0.0009518 -0.1115274 0.0203723 0.0051347 -0.0371756 0.0095686 0.0375196 0.1538222 0.0777159 0.0309978 0.0932291 0.0084329 -0.0814127 -0.0122702 0.1361321 -0.0000378 -0.0686737 -0.0019039 0.0078909 0.1273482 0.0253592 0.07729 -0.0066948 0.1371544 -0.018601 0.0482043 -0.0056448 0.0437692 0.0223471 -0.0095519 -0.0297073 0.0114632 0.1082434 -0.0620487 0.00487 0.0146102 0.0115948 -0.0364433 0.002895 0.038471 0.0192926 -0.110798 0.0843218 0.0543178 0.0905963 0.0413908 0.2602303 -0.0382541 -0.0728486 -0.1571213 0.1621665 0.0437782 -0.0627981 0.0728988 0.249858 0.1499379 -0.060183 -0.0279444 0.0272877 0.2436739 0.0532155 -0.0461214 0.0642744 0.2742423 0.0009859 0.0237998 0.0782387 0.0347366 0.1519398 -0.0272659 0.0994665 -0.0260378 -0.0551161 0.0085551 0.0132327 -0.0802083 0.0237708 0.1580432 -0.0014064 -0.0999404 -0.002732 -0.0619685 -0.1271892 0.041142 -0.0065289 0.0379977 0.1472741 -0.0024583 -0.0063739 -0.0027631 0.0949807 0.0458717 -0.0151201 -0.0363437 -0.0553189 0.029755 -0.09895 -0.1324081 -0.115227 -0.0316106 0.0966152 0.0173322 -0.010451 0.0810767 -0.1167828 0.0321691 -0.0381187 0.032246 0.0903292 -0.0857558 -0.0659713 0.1161242 -0.0272017 0.1017822 0.0558882 0.1392319 0.0760558 -0.0760161 unknown
polarizability: 187.9256712|14.9151282|98.6729452|-3.1020521|0.1591457|130.7404365 unknown
InChI: InChI=1S/C6H7NOP.C2H5S/c7-9(8)6-4-2-1-3-5-6;1-2-3/h1-5H,7H2;2H2,1H3
charge 0 multiplicity 1
24 atoms
S  1.939922 1.360518 0.93605
P  0.785626 -0.458576 0.09848
O  1.320306 -0.834365 -1.375096
N  1.022398 -1.520395 1.443604
C  -1.044101 -0.153703 0.106687
C  -1.75036 0.046039 1.315551
C  -1.71049 -0.116822 -1.140461
C  2.913046 1.765433 -0.657614
C  -3.143155 0.27903 1.273018
C  -3.103299 0.116809 -1.174013
C  -3.818888 0.315101 0.030089
C  4.414225 1.500588 -0.485027
H  -1.216411 0.020026 2.271737
H  -1.136412 -0.277858 -2.059736
H  2.48184 1.116735 -1.443974
H  2.690702 2.821104 -0.882669
H  0.443354 -2.35406 1.556492
H  1.933538 -1.52859 1.90281
H  -3.697936 0.435047 2.20453
H  -3.627726 0.143353 -2.13524
H  -4.898895 0.497957 0.000715
H  4.841667 2.082169 0.35075
H  4.601706 0.429748 -0.296264
H  4.951544 1.786114 -1.410318
