program: Gaussian 09
title: 000280842
version: EM64L-G09RevD.01
frameworkgroup: C1[X(C10H13O2P)]
method: RPBEPBE
basis: SDD
operation: Freq
keyword: #p
keyword: freq=noraman
keyword: PBEPBE/SDD
title: #p freq=noraman PBEPBE/SDD
converged: YES YES NO NO
title: Mulliken charges:
elementType: P O O C C C C C C C C C C H H H H H H H H H H H H H
charge: 1.129707 -0.542298 -0.624152 -0.714211 -0.714045 -0.382805 -0.397718 0.353437 -0.358448 -0.381323 -0.203314 -0.194150 -0.254055 0.277337 0.280140 0.291293 0.268717 0.222072 0.237338 0.237089 0.239650 0.299915 0.247378 0.227712 0.226852 0.227881
chargesum: 0.00000
title: Mulliken charges with hydrogens summed into heavy atoms:
elementType: P O O C C C C C C C C C C
charge: 1.129707 -0.542298 -0.624152 -0.156734 -0.154034 0.076605 0.079021 0.353437 -0.058533 -0.133944 0.024398 0.032702 -0.026174
polarizability: 1.74142277e+02 1.77215035e-01 1.30484012e+02 1.07890513e+01 5.99787109e+00 9.11059260e+01
1716.lowfreq: -9.2475 -7.6136 -0.0014 -0.0003 0.0013 15.3918 25.8699 34.8757 61.8732
frequency: 25.7559 33.5651 61.8193 109.5093 167.2820 197.0810 233.6399 250.8475 257.3428 308.2635 350.9844 409.8690 457.5213 487.2827 496.8617 537.0172 601.8247 620.8395 650.6529 689.3082 695.2058 763.3685 771.9584 823.4971 840.2823 861.0420 867.6181 876.7779 913.2574 970.6792 977.2666 982.4107 984.3995 988.9879 1014.5794 1021.9487 1059.0198 1077.6054 1086.4855 1126.0544 1165.5868 1176.3098 1195.2897 1199.6166 1201.6120 1259.4758 1266.3218 1312.5815 1317.9602 1328.2920 1378.3136 1420.9294 1429.2475 1440.7513 1462.8944 1469.2162 1472.3727 1590.0530 1603.4589 3003.1515 3010.4717 3036.7073 3038.7843 3069.0508 3080.2495 3120.1503 3126.8412 3127.9710 3136.9523 3152.0625 3160.4125 3170.9011
redmass: 4.0811 4.2516 3.1223 4.4277 3.6124 3.0858 7.1520 2.3929 2.6464 5.9764 5.7048 2.9705 5.8892 3.4354 2.5479 5.2921 6.4614 5.0830 5.2889 3.0906 2.3001 1.5458 1.4425 6.4833 1.2573 2.5619 1.9551 1.8633 1.4119 1.3557 1.3498 2.0817 4.9961 1.3091 4.3237 2.2258 2.6436 1.5280 1.2194 1.2133 1.1356 1.2950 1.8028 1.7230 1.4255 1.2103 1.2868 1.3379 1.3473 1.2439 7.9171 1.0845 1.0819 2.3004 1.0854 1.0929 2.1901 6.4445 6.1816 1.0622 1.0614 1.0618 1.0610 1.0993 1.1038 1.1051 1.1038 1.0848 1.0892 1.0934 1.0965 1.1009
irintensity: 0.9602 2.1936 0.2234 5.2174 0.3187 2.6646 5.5651 3.7536 1.3209 27.2711 17.2086 0.1570 23.9784 1.5213 18.6468 9.2790 16.8711 1.2946 39.2545 64.3292 36.9942 83.0376 15.5366 171.5951 2.4476 1.9456 36.8337 12.0465 13.3548 0.4257 3.9842 2.1879 0.9942 2.0125 59.2414 25.1289 13.2263 13.6680 58.2045 20.1435 20.4850 56.3818 91.6648 67.1118 1.4655 6.6768 9.5249 0.7455 3.4316 0.0637 2.6297 16.3282 6.8331 9.4839 13.3620 9.4595 125.8062 22.7936 72.0325 34.0569 24.7144 5.3836 5.6281 19.8483 33.8459 4.9399 5.5861 0.5571 16.3886 10.6840 20.6169 16.3091
temp: 298.150 k
press: 1.00000 atm
elementType: 15 8 8 6 6 6 6 6 6 6 6 6 6 1 1 1 1 1 1 1 1 1 1 1 1 1
symmnumber: 1
zpe: 547732.4 jmol-1
zpe.correction: 0.208620 hartree
zpe.thermalcorrener: 0.221165 hartree
zpe.thermalcorrenthalpy: 0.222109 hartree
zpe.thermalcorrgfe: 0.168155 hartree
zpe.sumelectzpe: -879.559028 hartree
zpe.sumelectthermal: -879.546483 hartree
zpe.sumelectthermalent: -879.545539 hartree
zpe.sumelectthermalfe: -879.599493 hartree
dipole: -2.1388 -3.6615 1.6595
dipole: 4.5536
quadrupole: -69.4410 -90.1799 -85.3179
quadrupole: 4.4220 1.4903 2.2467
quadrupole: 12.2052 -8.5336 -3.6716 4.4220 1.4903 2.2467
hfenergy: -879.7676479 hartree
pointgroup: C01 [X(C10H13O2P1)]
dipole: 0.80463 1.4626133 0.6502535 debye
dipolederiv: 2.1373452 -0.0950327 0.0233296 -0.4127246 1.2699087 0.0641808 0.3523336 0.0079111 1.2253618 -2.304731 0.2238701 0.0312135 0.3834804 -0.4757954 0.0123056 0.1966483 -0.0048848 -0.4594772 -0.7776902 0.0117211 0.0029556 0.0274082 -0.7751559 -0.0534374 -0.0384122 -0.0239282 -0.5973981 -0.2608838 -0.0675599 0.0000784 0.0005786 -0.1546046 -0.0514403 0.0148344 -0.0151035 -0.2405359 -0.1324423 -0.0348481 0.031662 -0.0988446 -0.1617908 0.014878 -0.012023 -0.0382911 -0.2404213 0.1849427 0.0139905 0.0579329 -0.0867754 0.0869321 -0.0279941 -0.0811239 -0.0331715 -0.014166 0.0176908 -0.1038608 0.0268771 0.0169668 0.0829429 0.0115613 0.0693117 0.0572618 0.0346669 1.6885239 -0.1708426 -0.0928633 0.1441997 0.0941664 0.0250891 -0.5709219 0.0705871 0.0688081 -0.3608572 0.0168471 -0.0160553 -0.2560997 -0.0771568 0.0090331 0.0939171 -0.0121523 -0.1675524 -0.4278089 0.0433079 -0.033092 0.1621431 -0.0180647 -0.0717414 -0.0324532 -0.0650952 -0.1424701 0.096855 -0.0176572 -0.0540625 0.0544169 0.1443635 -0.0721216 -0.067622 -0.0620715 -0.1087015 0.119015 -0.0248548 -0.0534234 -0.0311957 0.1102898 -0.0435497 -0.0406911 -0.059253 -0.1173851 -0.0230244 0.0103229 -0.0697171 -0.0080233 -0.169887 -0.0091144 -0.0372045 -0.0112826 -0.170187 0.0418322 -0.0142911 -0.0024455 -0.0373391 0.0220552 0.0703841 -0.0216639 0.0836138 -0.0176643 -0.0049272 0.0433073 0.0263129 0.0914155 0.0161849 -0.0493937 0.0625905 -0.0232128 0.0607705 0.1211727 -0.0014658 -0.0245001 -0.0047891 0.0776559 0.030622 -0.0460062 0.0025982 -0.057314 -0.0527128 0.0782768 0.0245391 0.0321056 -0.0074255 -0.0143508 -0.0075333 -0.0025651 0.0995969 -0.1015666 0.0639628 -0.0465454 0.1151941 -0.0104439 0.0690863 -0.0072098 0.0287653 0.0549453 0.0354491 -0.0358464 -0.0281452 -0.0723103 -0.0625295 -0.1320463 -0.025706 -0.102307 -0.0225901 0.0171476 0.1374585 -0.045477 0.0953246 -0.0329407 0.0099959 -0.0206296 0.0119341 0.0326905 -0.1279017 -0.1169619 0.0558155 -0.1268732 0.0224568 0.0199425 0.0250624 0.0032798 0.0631139 0.130444 0.074672 0.0227012 0.0564119 0.0550881 0.0163953 0.0210647 0.0118437 0.1595114 0.0742633 -0.0785826 0.0503565 -0.0732321 -0.0104829 0.0556188 0.0381236 0.0583218 0.1379463 0.0339839 -0.0606985 0.0391516 -0.0870702 -0.0596927 0.0677199 0.0489042 0.0676006 0.1270086 0.0020537 0.1028963 0.004146 0.114224 -0.0598826 0.0292342 0.0122822 0.0292588 0.1459015 -0.1261729 0.0018692 0.0692547 0.0014079 0.0938089 0.019143 0.0741278 0.0203424 0.145541 unknown
polarizability: 174.6591274|0.75957|130.2727667|-8.4153103|-6.7980593|90.8003212 unknown
InChI: InChI=1S/C10H13O2P/c11-13(8-4-5-9-13)12-10-6-2-1-3-7-10/h1-3,6-7H,4-5,8-9H2
charge 0 multiplicity 1
26 atoms
P  1.551354 -0.779337 -0.087646
O  0.246106 0.211009 -0.797784
O  1.331044 -2.365167 -0.128695
C  1.872926 0.060384 1.584228
C  2.967237 0.043204 -1.010316
C  3.195478 0.8476 1.366154
C  3.300242 1.27371 -0.131299
C  -1.105302 0.10679 -0.386192
C  -1.685014 -1.108596 0.055478
C  -1.875915 1.289589 -0.480114
C  -3.050517 -1.118401 0.420656
C  -3.241657 1.256709 -0.123635
C  -3.834174 0.055441 0.333686
H  1.952493 -0.713352 2.363446
H  1.020891 0.721631 1.813896
H  2.643522 0.295873 -2.030917
H  3.803368 -0.676505 -1.052694
H  4.055894 0.199529 1.619906
H  3.240261 1.730871 2.026603
H  2.57178 2.079044 -0.340298
H  4.307766 1.662784 -0.358976
H  -1.081686 -2.021757 0.093547
H  -1.398516 2.208343 -0.835103
H  -3.503362 -2.055661 0.763307
H  -3.840464 2.171298 -0.200294
H  -4.893154 0.034167 0.612255
