program: Gaussian 09
title: 000281027
version: EM64L-G09RevD.01
frameworkgroup: C1[X(C26H29NO2)]
method: RPBEPBE
basis: SDD
operation: Freq
keyword: #p
keyword: freq=noraman
keyword: PBEPBE/SDD
title: #p freq=noraman PBEPBE/SDD
converged: NO YES NO NO
title: Mulliken charges:
elementType: O O N C C C C C C C C C C C C C C C C C C C C C C C C C C H H H H H H H H H H H H H H H H H H H H H H H H H H H H H
charge: -0.275507 -0.247958 -0.120467 -0.189894 -0.250355 0.469139 0.469048 -0.635476 -0.655523 -0.453129 -0.350104 -0.351440 -0.457505 0.131078 0.057175 0.343709 0.370453 -0.229197 -0.248008 -0.238421 -0.227218 -0.246105 -0.242882 0.498243 -0.635157 -0.608253 -0.835523 -0.822043 -0.816640 0.207213 0.271629 0.261957 0.190681 0.216468 0.215329 0.187343 0.280811 0.235818 0.267614 0.261646 0.234666 0.223418 0.226550 0.229090 0.226014 0.225922 0.239475 0.237146 0.227999 0.254535 0.219337 0.255670 0.231699 0.222552 0.260743 0.225232 0.236496 0.224909
chargesum: 0.00000
title: Mulliken charges with hydrogens summed into heavy atoms:
elementType: O O N C C C C C C C C C C C C C C C C C C C C C C C C C C
charge: -0.275507 -0.247958 -0.120467 0.017319 0.021274 0.469139 0.469048 0.033631 0.027960 -0.217311 -0.082490 -0.089794 -0.222839 0.131078 0.057175 0.343709 0.370453 -0.005780 -0.021458 -0.009331 -0.001204 -0.020183 -0.014883 0.498243 -0.395682 -0.371107 -0.105981 -0.107050 -0.130003
polarizability: 3.38721929e+02 3.25594021e+01 2.52878351e+02 -2.40295516e+01 2.36147215e+01 2.76389069e+02
1716.lowfreq: -11.7503 -4.2231 -2.2464 0.0006 0.0007 0.0008 3.4056 18.5059 23.6767
frequency: -8.0267 18.4695 23.5977 34.9905 37.8087 42.9290 51.3083 58.5738 67.1481 82.8342 85.2728 99.1664 120.3010 139.2826 146.5370 156.5691 177.4713 192.4974 197.1170 222.1754 223.7167 230.7195 237.1657 249.4294 268.2850 277.6800 286.7989 317.9921 324.0738 335.3869 361.6499 374.2877 405.0564 407.6542 432.2811 470.5501 491.3087 509.5065 517.7699 522.8108 524.9721 559.1474 580.5143 590.4952 591.6851 616.1928 616.3468 621.5191 677.1738 700.2707 706.1087 708.8124 759.5474 762.7895 768.6741 786.2647 801.9973 831.6378 856.0853 858.2594 866.7042 889.4306 896.4688 908.0653 921.7718 935.4623 939.2845 954.4357 979.3166 979.9620 983.2026 991.1704 992.5557 996.1962 998.9526 1016.8424 1019.0709 1023.1232 1025.6236 1028.2752 1029.8499 1032.7944 1042.7039 1047.8439 1050.4216 1055.0345 1082.7354 1084.4145 1091.0312 1136.9105 1167.0044 1170.8692 1172.4497 1178.6935 1187.2338 1189.1872 1205.0588 1216.2025 1229.9830 1234.9749 1248.7720 1258.3708 1288.1828 1311.3826 1317.0293 1322.6547 1345.4098 1353.9261 1361.5386 1384.6156 1387.5267 1395.2716 1399.4084 1403.9448 1415.7881 1418.6362 1438.7788 1440.7363 1442.2991 1446.2637 1462.9384 1464.2587 1467.8276 1470.3747 1471.9955 1474.8708 1482.0533 1482.5312 1483.0207 1484.5302 1492.7601 1502.9437 1579.9356 1592.0857 1592.8802 1612.3520 1613.8757 1616.1115 1619.2910 2816.3448 2857.5677 2873.4236 2974.2923 2974.7321 2988.1223 3038.9968 3041.7041 3050.9924 3055.4583 3056.5379 3071.3675 3084.7094 3087.5385 3089.9663 3095.8886 3109.3373 3115.3295 3115.8007 3116.5504 3119.7970 3125.7642 3126.3335 3139.5566 3140.3330 3155.7001 3156.4278 3167.3242 3171.0311
redmass: 3.3443 5.0274 4.4743 1.0424 3.4564 4.3310 3.5200 3.8859 3.2648 2.0120 2.2305 2.9845 3.5872 3.8513 1.1056 3.5225 2.8326 2.7092 4.8061 2.6006 2.8289 2.1723 1.6917 2.0332 2.9192 3.9664 3.6990 3.4570 4.4397 3.0339 3.2153 5.0351 2.8576 2.8280 3.7631 2.7785 3.1278 3.2964 4.1140 4.0017 3.3492 4.4432 4.7980 3.5893 4.0852 6.3124 6.3588 5.9498 4.6557 4.9763 1.8023 1.6424 2.1224 3.6063 3.6462 3.1584 4.2362 4.9765 1.2487 1.2518 1.3051 3.5683 1.3117 3.4744 1.5165 1.7174 2.3799 3.5086 1.3911 1.7163 2.3535 5.6581 5.2263 1.3492 1.4075 1.6403 4.7218 1.6465 2.5794 2.0340 2.0350 1.9567 1.5645 1.6900 1.6612 1.5890 1.6133 1.6010 1.2763 1.4173 2.0994 1.0623 1.0618 2.9335 1.1201 1.1159 2.0304 2.1597 2.1181 2.1268 1.6994 1.4403 1.3488 1.4768 5.7937 1.3304 1.3930 1.6196 7.2379 5.8249 4.7948 1.2344 1.2987 1.2811 2.1392 1.1463 1.7923 2.0230 1.9067 1.3112 1.0599 1.0612 1.1034 1.0632 1.0665 1.1020 1.1436 2.1710 1.2395 1.8719 1.3488 1.0654 7.3025 6.0470 6.1105 6.1940 7.1731 6.8484 6.6898 1.0797 1.0561 1.0565 1.0385 1.0384 1.0370 1.0755 1.0748 1.0833 1.0952 1.0962 1.0967 1.0997 1.0997 1.0998 1.1003 1.0985 1.0872 1.0910 1.0860 1.0919 1.0876 1.0869 1.0932 1.0925 1.0964 1.0978 1.0995 1.0972
irintensity: 0.2437 0.3839 0.2394 0.3498 0.1863 0.3474 0.2539 0.2233 0.0490 0.4751 0.5113 0.3562 3.9364 1.9472 0.1245 2.9121 2.2368 0.4730 2.4090 1.6051 0.2698 0.2193 0.1924 0.2753 2.4220 8.0256 2.2992 1.8814 1.4226 8.4927 2.3358 1.6645 0.5980 0.2449 1.6704 3.1967 2.6392 0.5418 4.9881 5.4228 0.4416 1.2315 5.3731 33.1139 4.5928 0.9454 0.9708 9.0068 12.2769 4.1719 16.2458 142.7322 15.2054 2.9833 19.0139 12.7212 0.6047 13.4498 0.1490 0.1730 20.1816 19.5447 0.1661 15.8757 1.7425 13.9317 5.1899 6.8150 0.8411 17.0123 22.4705 2.1852 3.9319 5.4546 1.9919 7.7685 204.6021 11.2672 94.3473 22.5513 41.4456 34.6653 3.4325 1.9956 23.9353 43.2933 10.1184 4.7955 5.4682 6.0283 109.5244 0.2093 0.1185 6.4952 0.9489 1.6296 2.5778 18.6552 127.4413 30.9981 5.7536 9.0358 8.0856 6.4899 4.9242 4.0692 1.6061 11.1694 1.5329 1.3335 1.7233 14.9677 13.8271 10.7615 4.2435 4.7738 26.2127 7.3715 39.7289 10.4882 18.9577 15.2853 2.1765 5.2853 13.8345 6.4934 1.8733 9.6928 43.5803 4.2027 27.9876 20.1500 17.8437 0.4790 9.9026 6.2453 65.5376 46.4208 121.1635 64.1405 70.3978 204.6641 19.4982 35.9973 19.4040 8.1874 54.3680 8.9597 19.0422 8.6461 11.9465 15.3438 21.1348 22.5149 12.4051 21.7079 5.4150 26.8995 4.0038 16.7270 2.8760 1.0663 29.6085 21.0194 39.3179 35.7872 8.7458 6.6071
temp: 298.150 k
press: 1.00000 atm
elementType: 8 8 7 6 6 6 6 6 6 6 6 6 6 6 6 6 6 6 6 6 6 6 6 6 6 6 6 6 6 1 1 1 1 1 1 1 1 1 1 1 1 1 1 1 1 1 1 1 1 1 1 1 1 1 1 1 1 1
symmnumber: 1
zpe: 1258065.2 jmol-1
zpe.correction: 0.479172 hartree
zpe.thermalcorrener: 0.507213 hartree
zpe.thermalcorrenthalpy: 0.508157 hartree
zpe.thermalcorrgfe: 0.418859 hartree
zpe.sumelectzpe: -1211.261571 hartree
zpe.sumelectthermal: -1211.233530 hartree
zpe.sumelectthermalent: -1211.232586 hartree
zpe.sumelectthermalfe: -1211.321884 hartree
dipole: 0.9881 -0.3240 1.5767
dipole: 1.8887
quadrupole: -153.3313 -164.7728 -168.5576
quadrupole: 3.4426 -9.3426 6.5369
quadrupole: 8.8893 -2.5523 -6.3370 3.4426 -9.3426 6.5369
hfenergy: -1211.7407432 hartree
pointgroup: C01 [X(C26H29N1O2)]
dipole: -0.4580531 -0.3679229 -0.4549573 debye
polarizability: 326.1650643|-51.8852112|250.4632142|-5.8286233|1.1092879|291.3610702 unknown
InChI: InChI=1S/C26H29NO2/c1-18-16-19(2)23(20(3)17-18)26(28)29-25(22-14-10-7-11-15-22)24(27(4)5)21-12-8-6-9-13-21/h6-17,24-25H,1-5H3
charge 0 multiplicity 1
58 atoms
O  0.225123 0.534107 0.350299
O  1.448783 1.20672 2.224448
N  -0.923772 -1.356213 2.428705
C  -1.721172 -0.609237 1.407046
C  -1.060799 0.777253 1.066591
C  -1.969009 -1.446738 0.151213
C  -1.941306 1.666092 0.204834
C  -1.483018 -2.708469 2.691405
C  -0.788367 -0.615624 3.710375
C  -3.282937 -1.586715 -0.356615
C  -0.899883 -2.081605 -0.533422
C  -2.010756 1.51254 -1.202581
C  -2.728337 2.665873 0.8286
C  1.416999 0.739501 1.059525
C  2.60866 0.299537 0.264372
C  3.464878 -0.688398 0.836834
C  2.894493 0.869818 -1.011501
C  -3.532215 -2.339078 -1.527591
C  -1.145579 -2.83477 -1.701802
C  -2.854172 2.345812 -1.968969
C  -3.580556 3.494068 0.063521
C  -2.462237 -2.965593 -2.20572
C  -3.644362 3.336445 -1.34001
C  4.915925 -0.551697 -1.162846
C  4.599214 -1.105065 0.10072
C  4.051704 0.434513 -1.6981
C  3.169654 -1.308744 2.192446
C  2.009217 1.935972 -1.634618
C  6.161862 -0.98437 -1.91541
H  -2.724379 -0.33421 1.832758
H  -0.821791 1.301194 2.007941
H  -1.509726 -3.302543 1.765801
H  -2.519167 -2.674935 3.112157
H  -0.834123 -3.227565 3.418313
H  -0.292676 -1.273468 4.445266
H  -1.778084 -0.311283 4.136108
H  -0.151582 0.274483 3.59023
H  -4.116318 -1.098626 0.163651
H  0.116527 -1.982746 -0.141989
H  -1.406336 0.740647 -1.689053
H  -2.666738 2.804844 1.915421
H  -4.555869 -2.435065 -1.90689
H  -0.310253 -3.319175 -2.220475
H  -2.898073 2.21944 -3.056588
H  -4.18253 4.264668 0.558084
H  -2.650826 -3.551647 -3.112559
H  5.250526 -1.87787 0.527839
H  4.283678 0.877547 -2.674898
H  -4.298336 3.981796 -1.93741
H  2.118626 -1.647516 2.266956
H  3.830372 -2.172373 2.378586
H  3.320294 -0.572508 3.002695
H  1.790278 2.754976 -0.925177
H  2.493309 2.376368 -2.522741
H  1.034545 1.517154 -1.940253
H  5.985819 -1.017407 -3.005498
H  6.996078 -0.277086 -1.740665
H  6.504521 -1.982927 -1.592656
