program: Gaussian 09
title: 000025254
version: EM64L-G09RevD.01
frameworkgroup: C1[X(C5H11Br)]
method: RPBEPBE
basis: SDD
operation: Freq
keyword: #pfreq=noraman
keyword: PBEPBE/SDD
title: #p freq=noraman PBEPBE/SDD
converged: YES YES NO NO
title: Mulliken charges:
elementType: Br C C C C C H H H H H H H H H H H
charge: -0.054444 -0.005169 -0.324499 -0.692425 -0.710937 -0.703776 0.227524 0.221946 0.186929 0.277594 0.269201 0.217545 0.232716 0.210210 0.214344 0.220762 0.212479
chargesum: 0.00000
title: Mulliken charges with hydrogens summed into heavy atoms:
elementType: Br C C C C C
charge: -0.054444 0.222355 0.084377 -0.145630 -0.050467 -0.056192
polarizability: 8.63724934e+01 -9.93620106e+00 6.78152256e+01 -2.22600691e+00 1.99719721e+00 5.19876767e+01
1716.lowfreq: -16.5806 -4.0672 -0.0005 -0.0004 -0.0002 11.3073 65.4231 95.1255 160.3085
frequency: 65.4075 95.0884 160.3083 194.8987 225.6169 267.0027 299.0359 394.9168 447.0311 616.4002 756.0690 788.0726 866.8095 922.3184 966.8010 981.5334 1048.9387 1057.3748 1123.5508 1156.4036 1195.1933 1233.3354 1267.4175 1302.3418 1322.1140 1353.4424 1380.9273 1393.8685 1439.7116 1463.8829 1473.8701 1477.2230 1483.6369 1490.9886 2966.6959 2976.1906 2978.4744 2992.0852 3031.9987 3040.3737 3068.2125 3073.2343 3076.9903 3088.0160 3126.2370
redmass: 1.9255 3.0374 2.3356 1.0466 1.5894 2.4171 2.3357 2.0498 2.7298 4.1683 1.7139 1.3783 1.4386 1.5946 1.2069 1.8548 3.0187 1.1778 1.9473 1.9788 1.6768 1.1616 1.2331 1.2805 1.2962 1.5622 1.2045 1.2031 1.1051 1.0643 1.0449 1.0668 1.0547 1.0477 1.0639 1.0367 1.0366 1.0814 1.0975 1.0573 1.0996 1.0995 1.0996 1.0979 1.1104
irintensity: 0.3358 1.0322 1.2954 0.0883 0.6462 0.8156 0.7854 1.6658 0.9317 37.8541 2.8273 4.0491 8.2466 20.4956 5.7153 17.4540 0.3160 0.7852 0.6626 5.1052 2.4826 29.6208 3.2920 6.6071 1.0334 1.1573 16.5611 13.7186 8.1254 1.5766 16.1178 6.7609 22.2278 6.1056 22.4254 28.9970 30.6446 20.5548 4.8343 23.8510 21.5750 71.9447 52.4027 29.4599 15.5415
temp: 298.150 k
press: 1.00000 atm
elementType: 35 6 6 6 6 6 1 1 1 1 1 1 1 1 1 1 1
symmnumber: 1
zpe: 389564.1 jmol-1
zpe.correction: 0.148377 hartree
zpe.thermalcorrener: 0.156682 hartree
zpe.thermalcorrenthalpy: 0.157626 hartree
zpe.thermalcorrgfe: 0.114308 hartree
zpe.sumelectzpe: -210.078913 hartree
zpe.sumelectthermal: -210.070609 hartree
zpe.sumelectthermalent: -210.069665 hartree
zpe.sumelectthermalfe: -210.112982 hartree
dipole: -2.3327 1.1875 0.3019
dipole: 2.6350
quadrupole: -51.2383 -46.6419 -48.2774
quadrupole: -0.2563 -0.0836 0.3667
quadrupole: -2.5191 2.0773 0.4418 -0.2563 -0.0836 0.3667
hfenergy: -210.2272904 hartree
pointgroup: C01 [X(C5H11Br1)]
dipole: -0.7895677 -0.6315378 -0.2289803 debye
dipolederiv: -0.459711 -0.1811952 -0.0299247 -0.2615126 -0.3447093 -0.0434412 -0.0876334 -0.068553 -0.1809377 0.0084084 -0.008149 0.0175346 -0.2093644 -0.0516585 -0.0280196 -0.0563119 -0.0739009 0.0869097 0.0029078 0.002617 0.0162654 -0.0321071 0.0433661 0.0214873 0.0390353 0.0467852 0.1485273 0.5391267 0.3684098 0.1126117 0.4634813 0.4111068 0.1198406 0.1077163 0.1170669 0.173977 -0.1442124 -0.1274205 -0.0177648 0.0656751 0.0139652 -0.0028213 0.0762108 0.0579441 0.1113656 -0.0382973 0.0556784 0.0334869 0.0785877 0.0529162 0.0118023 0.0110042 0.0121459 0.0661962 0.0450764 -0.0113592 -0.0008812 0.0234359 0.0368253 -0.0436603 -0.0050345 -0.0163686 -0.1509431 0.0104811 -0.1050857 0.01271 -0.084841 -0.0849673 0.0043477 -0.0027851 -0.0202225 0.0779466 0.0346161 0.0363837 0.0081823 0.0227213 0.0493031 -0.0838705 -0.0005194 -0.0284778 -0.1912449 -0.0395951 -0.0180725 -0.0347735 0.0315927 -0.1399169 0.0187973 -0.0604174 0.0193609 0.0645659 0.015736 -0.0715534 -0.064744 -0.080388 0.0246114 -0.0473021 0.0204873 -0.0442539 -0.1102422 0.0535085 0.126249 -0.0638338 0.074672 -0.103238 0.0774946 -0.0554769 0.0908703 0.0401353 -0.1663526 -0.0405219 0.0620754 -0.0371954 0.0862145 -0.0298253 0.0631789 -0.0171588 0.069649 0.1038115 0.0003187 0.0193538 -0.0118892 0.0684071 -0.0029395 -0.0223142 -0.079332 -0.1596395 0.0624583 -0.0073678 -0.0403067 -0.0081278 0.0911855 -0.0240865 0.0215405 -0.0539954 -0.1718034 0.0097415 0.0902815 -0.0289646 0.1343879 -0.0997524 0.0824338 -0.0445105 0.0976379 0.0521281 -0.037704 -0.1092128 -0.0010269 -0.1691286 -0.0536587 -0.0302373 -0.0041702 -0.0395485 0.0734099 unknown
polarizability: 81.1108743|12.2946143|71.9749381|4.843628|5.0034448|53.0895834 unknown
InChI: InChI=1S/C5H11Br/c1-3-5(2)4-6/h5H,3-4H2,1-2H3
charge 0 multiplicity 1
17 atoms
Br 2.597537 0.866795 0.378725
C  -0.097932 -0.434003 0.255404
C  -0.780715 0.790776 -0.406611
C  1.346053 -0.629286 -0.233081
C  -0.868571 -1.754424 -0.025606
C  -2.162305 1.13548 0.190872
H  -0.07346 -0.272633 1.352138
H  -0.112998 1.666784 -0.298713
H  -0.879861 0.598641 -1.495656
H  1.810415 -1.539146 0.178268
H  1.425498 -0.619224 -1.332883
H  -0.395355 -2.615936 0.480848
H  -1.907787 -1.682117 0.338946
H  -0.904608 -1.969718 -1.110876
H  -2.086289 1.317265 1.279704
H  -2.573159 2.050658 -0.272851
H  -2.898163 0.325988 0.033071
