program: Gaussian 09
title: 000280825
version: EM64L-G09RevD.01
frameworkgroup: C1[X(C9H9N3O4)]
method: RPBEPBE
basis: SDD
operation: Freq
keyword: #pfreq=noraman
keyword: PBEPBE/SDD
title: #p freq=noraman PBEPBE/SDD
converged: YES YES NO NO
title: Mulliken charges:
elementType: O O O O N N N C C C C C C C C C H H H H H H H H H
charge: -0.315390 -0.209520 -0.205618 -0.229791 0.026222 0.051677 -0.373718 0.446905 0.383697 -0.355583 -0.332593 -0.353240 -0.348321 -0.327490 0.312147 -0.601379 0.240092 0.290546 0.289224 0.290270 0.249945 0.329819 0.272056 0.235076 0.234965
chargesum: 0.00000
title: Mulliken charges with hydrogens summed into heavy atoms:
elementType: O O O O N N N C C C C C C C C C
charge: -0.315390 -0.209520 -0.205618 -0.229791 0.026222 0.051677 -0.043899 0.446905 0.383697 -0.115491 -0.042047 -0.064016 -0.058050 -0.077545 0.312147 0.140719
polarizability: 3.08719373e+02 3.91043503e+00 1.34883517e+02 3.87890364e-02 -1.94986786e-02 5.68828820e+01
1716.lowfreq: -0.0012 -0.0009 -0.0006 2.7906 4.9790 12.5697 24.7561 32.5643 48.1002
frequency: 24.6973 32.5510 48.0908 66.8336 80.4558 86.4790 145.1871 149.5676 173.8230 199.8087 204.3291 247.5107 291.6973 343.9954 393.2238 410.2000 412.0472 503.9111 507.7283 545.7263 578.6229 622.7753 640.5819 667.3505 682.0911 690.1123 742.0808 776.6870 826.0628 849.2417 875.2219 895.6292 907.0590 954.4163 991.1225 1003.6967 1010.6909 1032.3691 1092.2533 1111.6352 1125.3785 1147.6795 1178.6058 1188.2281 1217.6211 1226.7814 1300.0981 1330.3323 1361.1160 1400.5682 1418.5821 1433.7766 1456.8106 1481.4656 1483.3982 1510.4807 1548.1844 1592.8887 1610.8044 1746.8970 2986.0236 3066.4370 3070.4806 3116.9484 3140.1743 3164.3243 3184.6356 3187.7736 3572.2638
redmass: 4.8713 6.3219 6.2903 6.8419 6.4142 1.1015 3.4372 6.2123 4.1777 8.2537 9.2631 5.9560 5.2582 5.3445 7.3934 6.8967 2.9179 7.8161 3.2532 6.7667 1.1202 7.2598 7.8639 4.6321 11.9829 6.8970 4.3889 7.8876 4.8962 1.3086 1.4535 6.1422 6.1351 1.4891 1.3754 3.0181 1.3499 5.6340 3.2471 1.3156 1.2818 1.6176 1.3874 2.3263 3.6625 2.1217 1.3275 2.0239 6.9070 7.7296 4.3373 1.1544 1.3355 2.5746 1.0435 1.3349 6.5196 7.4308 6.2692 10.2789 1.0351 1.1029 1.0905 1.0989 1.0907 1.0903 1.0947 1.0965 1.0773
irintensity: 5.8494 0.4546 1.5361 0.1207 4.7599 0.3436 3.2596 5.6448 1.2260 1.4008 2.4274 14.0354 20.5241 1.3801 1.4573 1.3560 0.0357 0.8361 19.0219 11.8407 146.6283 0.4824 3.0900 26.0650 20.7059 0.7476 1.3166 29.1126 116.3170 10.9897 36.4610 485.1476 184.7680 46.1007 0.1339 1.0109 0.0004 551.0668 15.7670 15.3063 0.0055 49.6737 127.1305 265.2553 293.8063 26.0184 0.8396 5.9621 82.1485 31.0574 42.7878 26.1237 233.2624 0.8880 16.8792 232.3073 10.3021 7.8207 41.0008 245.3644 87.4060 33.8140 13.8807 3.7906 8.8868 0.4290 0.6873 1.7106 48.3675
temp: 298.150 k
press: 1.00000 atm
elementType: 8 8 8 8 7 7 7 6 6 6 6 6 6 6 6 6 1 1 1 1 1 1 1 1 1
symmnumber: 1
zpe: 466940.3 jmol-1
zpe.correction: 0.177848 hartree
zpe.thermalcorrener: 0.193199 hartree
zpe.thermalcorrenthalpy: 0.194143 hartree
zpe.thermalcorrgfe: 0.132545 hartree
zpe.sumelectzpe: -812.222033 hartree
zpe.sumelectthermal: -812.206682 hartree
zpe.sumelectthermalent: -812.205738 hartree
zpe.sumelectthermalfe: -812.267335 hartree
dipole: -7.0223 -4.8757 -0.0127
dipole: 8.5490
quadrupole: -97.3107 -88.6485 -93.0301
quadrupole: 6.5207 0.0410 -0.0038
quadrupole: -4.3143 4.3479 -0.0336 6.5207 0.0410 -0.0038
hfenergy: -812.3998809 hartree
pointgroup: C01 [X(C9H9N3O4)]
dipole: 2.7686933 1.9097235 0.0079473 debye
dipolederiv: -2.964869 0.3919309 0.0051203 0.1750955 -0.4843929 -0.001965 0.0034457 -0.00237 -0.1737944 -0.9972205 0.1678832 0.0028272 0.2866424 -0.5712943 -0.0038841 0.0039863 -0.0036445 -0.2319355 -0.7329609 -0.1852878 -0.0010997 -0.3713499 -0.7598792 -0.0048794 -0.0027535 -0.004993 -0.2289552 -0.7878874 -0.0212196 0.0005479 0.2850999 -1.03015 -0.0039616 0.0027421 -0.0037315 -0.3268351 2.2438817 0.1482545 -0.0015594 0.2735796 1.1205243 0.0091691 -0.0007451 0.0090185 0.1937961 1.5118383 -0.1644163 -0.0024566 0.5770756 -0.1310375 -0.0006143 0.0027235 -0.0001216 -0.1019672 -1.7077772 -0.1706333 0.0002804 -0.216371 -0.4557575 0.0007056 0.0016997 0.0006462 -0.5092385 0.6030512 -0.0161242 -0.000644 0.0306313 0.0337422 0.0001067 0.0001842 0.0001338 0.0343491 -1.0090144 -0.1599051 -0.0001827 -0.2929026 0.0233306 -0.0000833 -0.001059 -0.0000926 0.0503177 -0.4789067 0.1368891 0.0015428 0.1192184 0.1181336 0.0022863 0.0013695 0.0022829 -0.1595555 -0.2887692 -0.1859737 -0.0016064 -0.3046343 -0.0879788 0.0006031 -0.0025965 0.0003824 -0.1123841 0.2947031 -0.0995015 -0.0013841 0.2549995 -0.0390108 0.0001509 0.0018117 0.0007532 -0.0957431 0.2690549 0.1858998 0.0012856 -0.0922344 -0.0123867 0.0009443 -0.0014431 0.0005245 -0.097639 -0.2391601 0.0843311 0.0007994 0.467294 0.247234 0.0016187 0.0036301 0.0021054 -0.0485858 3.181229 -0.0013598 -0.0039117 -0.9858069 1.5905994 0.0076085 -0.0113582 0.0072301 0.3140175 0.6482656 -0.0499718 0.0000047 -0.3758456 0.0471651 -0.0011807 -0.0027306 -0.0017902 0.2720215 0.063496 -0.0768903 -0.0005348 -0.0601115 -0.0588233 -0.001826 -0.0004179 -0.0017919 0.1557469 0.0642344 0.0563813 0.0006694 0.0508994 0.0556146 -0.0009491 0.0006181 -0.0009068 0.1539196 0.0742707 0.0661971 0.0007282 0.0255231 0.0847483 -0.0008073 0.000376 -0.0009217 0.1733744 0.1061515 -0.0444638 -0.0003365 -0.0090885 0.0492421 -0.0010747 0.0000544 -0.0010785 0.1700323 0.0239409 -0.0064123 0.0001692 -0.0497527 -0.076461 -0.0019111 -0.0003026 -0.001969 0.1922963 0.2207673 0.0247755 0.0004263 0.136448 0.1567819 -0.0012876 0.0009018 -0.0012735 0.3787347 0.1523607 -0.0745418 -0.0008122 0.049613 -0.0252178 -0.0015252 0.0000576 -0.0012749 0.1358532 -0.1256998 -0.0023084 -0.0799945 0.0145297 0.103564 -0.0719277 -0.1601695 -0.0530739 -0.0700132 -0.1249802 -0.0035329 0.0801213 0.0114481 0.1017096 0.0746842 0.1599755 0.0559566 -0.0678125 unknown
polarizability: 308.74155|3.376568|134.8556682|-0.2412035|0.648591|56.888554 unknown
InChI: InChI=1S/C9H9N3O4/c1-10-9(13)16-11-6-7-2-4-8(5-3-7)12(14)15/h2-6,10H,1H3
charge 0 multiplicity 1
25 atoms
O  3.158276 0.6484 0.001855
O  -5.52567 0.568107 0.012242
O  -4.996165 -1.651932 -0.010783
O  4.06799 -1.581725 -0.012354
N  -4.671171 -0.401665 0.001211
N  1.842208 0.027649 -0.00205
N  5.401457 0.362366 -0.004036
C  -0.497527 0.592069 0.004246
C  -3.229336 -0.058171 0.002192
C  -1.482316 1.619372 0.014645
C  -0.909779 -0.773582 -0.007592
C  -2.85265 1.302208 0.013829
C  -2.273646 -1.102554 -0.008653
C  0.922988 0.970588 0.006047
C  4.228239 -0.350623 -0.005889
C  6.709199 -0.301728 -0.008908
H  -1.170041 2.669915 0.023527
H  -0.145717 -1.556579 -0.015592
H  -3.625962 2.07441 0.02194
H  -2.615948 -2.140529 -0.017682
H  1.184019 2.04059 0.013411
H  5.340431 1.380916 0.001054
H  6.540346 -1.389943 -0.017906
H  7.292157 -0.04155 0.893331
H  7.292619 -0.026706 -0.906382
