program: Gaussian 09
title: 000280889
version: EM64L-G09RevD.01
frameworkgroup: C1[X(C22H32N4)]
method: RPBEPBE
basis: SDD
operation: Freq
keyword: #pfreq=noraman
keyword: PBEPBE/SDD
title: #p freq=noraman PBEPBE/SDD
converged: YES YES NO NO
title: Mulliken charges:
elementType: N N N N C C C C C C C C C C C C C C C C C C C C C C H H H H H H H H H H H H H H H H H H H H H H H H H H H H H H H H
charge: -0.095993 -0.096157 -0.198271 -0.198198 -0.343631 -0.385738 -0.385792 -0.418616 -0.482102 -0.482300 0.303684 0.303849 0.227270 0.227102 -0.375833 -0.375752 -0.341301 -0.341408 -0.261354 -0.261372 -0.253998 -0.253974 -0.656065 -0.646386 -0.655979 -0.646464 0.145540 0.221947 0.175314 0.249311 0.249309 0.175376 0.222921 0.187411 0.227922 0.200282 0.200250 0.227977 0.277525 0.277540 0.234691 0.234704 0.224196 0.224199 0.219579 0.219574 0.224245 0.196925 0.244861 0.220807 0.253978 0.208725 0.224285 0.244822 0.196914 0.220744 0.208764 0.254143
chargesum: 0.00000
title: Mulliken charges with hydrogens summed into heavy atoms:
elementType: N N N N C C C C C C C C C C C C C C C C C C C C C C
charge: -0.095993 -0.096157 -0.198271 -0.198198 0.023855 0.038887 0.038893 -0.008284 -0.053899 -0.054073 0.303684 0.303849 0.227270 0.227102 -0.098308 -0.098212 -0.106610 -0.106704 -0.037158 -0.037173 -0.034419 -0.034400 0.009965 0.037124 0.010042 0.037187
polarizability: 3.39404999e+02 -8.33507512e-03 2.95911225e+02 -6.91202909e-03 -7.16557727e+00 1.71797123e+02
1716.lowfreq: -7.6318 -3.9709 -0.0007 -0.0004 0.0010 5.1377 18.7913 21.2088 27.0665
frequency: 18.7739 21.2053 27.0570 49.5195 63.4030 67.6717 90.3931 92.5046 101.7026 119.2456 121.6237 145.1308 158.8980 166.1054 191.7602 198.8224 204.3773 221.3873 236.1578 266.8914 267.0307 289.5929 297.2733 307.6520 325.5434 332.6684 339.8238 347.8398 359.3214 379.7369 391.8366 438.1665 443.3466 470.5628 470.9901 498.4048 512.1017 512.5570 533.0928 555.1377 557.7815 583.3676 611.4849 637.8377 712.2064 716.1725 731.3226 736.1322 767.9169 768.3390 771.0757 794.8058 808.0649 842.4888 863.7104 863.8206 901.0209 917.5192 944.1137 944.6815 947.9026 948.6157 962.6765 975.9389 977.5000 994.1315 999.7725 1038.6927 1043.5041 1043.8168 1048.6175 1049.0424 1049.8819 1076.3694 1080.5171 1089.9207 1089.9835 1104.3964 1111.3131 1131.8252 1133.4991 1133.6674 1153.6751 1153.9182 1162.3109 1170.4248 1170.5530 1181.2141 1187.5033 1197.3784 1199.0374 1204.8814 1206.1255 1212.4050 1260.5045 1269.9775 1284.5163 1291.7879 1294.2694 1295.5446 1319.7981 1325.4407 1333.5795 1345.5388 1345.8105 1356.3968 1374.8103 1377.9080 1386.1527 1406.4619 1423.9192 1424.0067 1432.6073 1432.8421 1443.8617 1448.6097 1448.6609 1454.7596 1460.5788 1463.4990 1466.8641 1470.0914 1470.3901 1471.5374 1471.7391 1476.4876 1485.0684 1485.2816 1491.9122 1492.3004 1503.0172 1503.1156 1579.3167 1579.4163 1607.2955 1607.6804 2656.7964 2821.8795 2830.7240 2866.8956 2867.5140 2885.2961 2885.4872 2900.1381 2900.5285 2964.7237 2965.1818 3001.6361 3012.1492 3020.4894 3020.7424 3021.0582 3021.2673 3050.2519 3053.6582 3068.9389 3090.0679 3090.3507 3115.1613 3115.6215 3120.1248 3120.1514 3133.0021 3133.1057 3147.3140 3147.4121 3160.2159 3160.3348
redmass: 4.6488 4.1824 4.0068 3.6969 3.4755 3.9301 2.7229 2.6993 3.3303 2.4072 3.0734 2.0741 1.4637 2.0518 3.7632 2.7693 1.8549 3.7080 1.9616 1.4648 1.7241 1.4619 1.8669 2.0715 2.8502 3.2350 3.2982 2.6847 2.6106 2.7758 1.7300 3.9227 3.4610 3.3485 3.3894 2.7004 3.6139 3.9552 4.0577 3.4386 3.6918 5.3176 5.3124 3.0194 4.1609 3.3828 2.5069 2.9719 1.5805 1.7001 2.5775 4.5136 4.5345 2.8611 1.3600 1.3885 1.4159 2.4778 3.3341 3.3228 1.4238 1.4354 2.6305 1.5156 1.4240 1.6598 1.6235 1.9583 1.9914 1.9722 1.6274 1.5381 1.9724 2.3809 2.2974 1.2622 1.2575 2.2153 2.1581 2.7710 1.4470 1.5460 1.6921 1.6923 2.6012 1.0988 1.0955 1.1059 2.2237 1.8989 2.1087 3.7791 3.4280 1.1875 1.4978 1.5913 1.3111 1.2756 1.5931 1.4466 1.7540 2.5128 2.1978 2.2477 1.4147 1.4548 1.4875 3.3684 2.9637 1.4846 1.1599 1.1586 1.7301 1.7401 1.0934 1.3815 1.3778 1.1082 1.0929 1.0637 1.1056 1.2296 1.2300 1.0885 1.0934 1.0996 1.1798 1.1976 1.2711 1.2408 1.2695 1.2689 6.7725 6.7859 6.2565 6.2474 1.0682 1.0712 1.0704 1.0674 1.0673 1.0543 1.0543 1.0546 1.0546 1.0885 1.0884 1.0607 1.0852 1.0784 1.0794 1.0810 1.0799 1.0868 1.0890 1.1025 1.0993 1.0994 1.0949 1.0949 1.0846 1.0847 1.0892 1.0892 1.0933 1.0933 1.0999 1.0999
irintensity: 0.0567 0.0069 0.0409 0.6536 0.0646 0.4779 4.7488 0.2695 1.4111 0.1325 1.0133 0.0140 0.3184 2.1522 4.0655 3.4243 1.6243 0.1002 6.8849 0.1005 0.0246 8.7231 5.6317 2.4732 2.0698 1.5890 0.5548 1.6430 0.4644 3.6638 5.6033 0.2596 4.4832 18.8464 1.3143 0.2646 1.4911 9.4987 0.0005 9.3969 0.0033 1.0538 4.6290 1.1792 15.8324 0.1287 21.0700 0.4047 12.8223 95.9625 42.6241 5.7349 2.1421 1.7352 1.3655 1.0468 6.9204 3.6724 24.7795 41.1025 7.5671 8.4846 26.1020 11.1194 1.3581 0.0233 14.6638 9.0888 4.7144 33.3777 32.9085 16.7737 14.0875 12.5397 96.9654 3.9397 14.0155 3.7903 102.8005 3.6339 51.2980 10.1588 11.8439 19.6595 7.2325 1.1997 1.9460 12.9993 16.8691 19.7752 5.2797 1.0413 24.5921 0.7980 21.3785 19.0336 14.5727 8.0794 12.9243 19.6383 43.6063 29.4614 0.1979 46.7095 0.1961 6.2804 0.1922 3.3211 6.2025 22.6783 6.0918 4.0073 22.8134 5.2418 9.9466 1.3454 0.3449 12.5215 8.2961 8.3312 21.1885 59.1326 0.0323 3.8474 77.1211 5.6258 1.3566 27.7926 1.9130 5.6016 25.6438 66.9524 11.3094 6.9194 16.1001 61.2787 124.8037 1.6895 160.0465 16.7943 91.5602 153.8213 55.6052 134.9677 223.7280 15.6980 37.3057 33.0760 38.8037 53.9519 98.2768 11.4067 10.9507 37.5842 23.0579 33.8820 23.3974 26.3811 23.1723 22.9720 2.8177 3.1805 4.2171 8.6234 26.6644 26.4636 32.4571 33.2604
temp: 298.150 k
press: 1.00000 atm
elementType: 7 7 7 7 6 6 6 6 6 6 6 6 6 6 6 6 6 6 6 6 6 6 6 6 6 6 1 1 1 1 1 1 1 1 1 1 1 1 1 1 1 1 1 1 1 1 1 1 1 1 1 1 1 1 1 1 1 1
symmnumber: 1
zpe: 1313211.1 jmol-1
zpe.correction: 0.500176 hartree
zpe.thermalcorrener: 0.526233 hartree
zpe.thermalcorrenthalpy: 0.527177 hartree
zpe.thermalcorrgfe: 0.443049 hartree
zpe.sumelectzpe: -1074.511403 hartree
zpe.sumelectthermal: -1074.485345 hartree
zpe.sumelectthermalent: -1074.484401 hartree
zpe.sumelectthermalfe: -1074.568530 hartree
dipole: 0.0009 -3.7019 0.4224
dipole: 3.7259
quadrupole: -135.5919 -146.9448 -159.9740
quadrupole: -0.0047 -0.0205 3.1638
quadrupole: 11.9117 0.5587 -12.4704 -0.0047 -0.0205 3.1638
hfenergy: -1075.0115786 hartree
pointgroup: C01 [X(C22H32N4)]
dipole: 0.0012236 -1.463997 -0.0745211 debye
polarizability: 339.38554|0.0377708|296.3200942|1.8071352|-0.6587349|171.4077133 unknown
InChI: InChI=1S/C22H32N4/c1-23(2)21-12-7-5-10-19(21)16-25-14-9-15-26(18-25)17-20-11-6-8-13-22(20)24(3)4/h5-8,10-13H,9,14-18H2,1-4H3
charge 0 multiplicity 1
58 atoms
N  1.22318 -0.068165 -0.139185
N  -1.218801 -0.069603 -0.165989
N  5.21878 -1.678365 0.059933
N  -5.216221 -1.683865 -0.052496
C  -0.001739 -0.794192 0.254324
C  1.280711 0.126937 -1.609163
C  -1.244217 0.124832 -1.63701
C  0.022723 0.875064 -2.08623
C  2.444852 -0.712291 0.401309
C  -2.451199 -0.714933 0.348174
C  3.65181 0.224763 0.399229
C  -3.658632 0.220956 0.319166
C  4.982595 -0.269706 0.19737
C  -4.984303 -0.274883 0.08878
C  3.451281 1.617077 0.547248
C  -3.462583 1.613444 0.471166
C  6.052484 0.66454 0.087595
C  -6.052346 0.658445 -0.044193
C  4.52215 2.534146 0.46302
C  -4.532145 2.5296 0.363429
C  5.826337 2.051144 0.213697
C  -5.830189 2.045345 0.086206
C  6.424592 -2.104397 -0.668209
C  4.933271 -2.539749 1.226904
C  -6.407022 -2.111982 -0.803894
C  -4.954907 -2.543325 1.121821
H  0.003572 -1.844174 -0.185217
H  -0.013873 -0.891763 1.356124
H  1.349926 -0.86124 -2.138633
H  2.193236 0.698103 -1.851725
H  -2.152019 0.694424 -1.900078
H  -1.299899 -0.86355 -2.167569
H  0.017051 1.891381 -1.653118
H  0.034859 0.963418 -3.189243
H  2.719475 -1.638813 -0.162289
H  2.208649 -1.02832 1.439556
H  -2.237191 -1.029563 1.391699
H  -2.712512 -1.642173 -0.220476
H  2.419776 1.961905 0.681927
H  -2.434475 1.959181 0.627821
H  7.072126 0.301801 -0.078301
H  -7.068006 0.295028 -0.231686
H  4.338293 3.608477 0.573345
H  -4.351683 3.604127 0.477374
H  6.66877 2.747828 0.129633
H  -6.671332 2.74115 -0.016088
H  6.313705 -3.167863 -0.949947
H  7.365015 -2.011634 -0.073187
H  6.537155 -1.513551 -1.592429
H  4.783005 -3.584803 0.89703
H  4.022215 -2.207569 1.745347
H  5.766921 -2.525323 1.968073
H  -6.289281 -3.175586 -1.082154
H  -6.501758 -1.522199 -1.730756
H  -7.358919 -2.019518 -0.227393
H  -4.801355 -3.589444 0.796884
H  -5.802386 -2.525193 1.847123
H  -4.052727 -2.213076 1.656847
