program: Gaussian 09
title: 000280922
version: EM64L-G09RevD.01
frameworkgroup: C1[X(C26H16F4)]
method: RPBEPBE
basis: SDD
operation: Freq
keyword: #pfreq=noraman
keyword: PBEPBE/SDD
title: #p freq=noraman PBEPBE/SDD
converged: YES YES NO NO
title: Mulliken charges:
elementType: F F F F C C C C C C C C C C C C C C C C C C C C C C C C C C H H H H H H H H H H H H H H H H
charge: -0.202214 -0.202221 -0.202216 -0.202220 0.121735 0.121819 0.272787 0.273719 0.272766 0.273699 -0.362547 -0.362591 -0.362542 -0.362580 -0.371511 -0.371127 -0.371496 -0.371114 -0.374828 -0.374987 -0.374834 -0.375001 -0.374342 -0.374668 -0.374359 -0.374693 0.310620 0.310695 0.310624 0.310697 0.261758 0.261770 0.261753 0.261782 0.262753 0.262789 0.262767 0.262805 0.258619 0.258587 0.258619 0.258587 0.257579 0.257589 0.257580 0.257591
chargesum: 0.00000
title: Mulliken charges with hydrogens summed into heavy atoms:
elementType: F F F F C C C C C C C C C C C C C C C C C C C C C C C C C C
charge: -0.202214 -0.202221 -0.202216 -0.202220 0.121735 0.121819 0.272787 0.273719 0.272766 0.273699 -0.100789 -0.100821 -0.100789 -0.100797 -0.108758 -0.108338 -0.108729 -0.108308 -0.116208 -0.116400 -0.116215 -0.116414 -0.116764 -0.117079 -0.116779 -0.117103 0.310620 0.310695 0.310624 0.310697
polarizability: 3.63503195e+02 -1.19308742e-01 3.53845317e+02 3.35504249e-03 -8.71291918e-04 1.91456807e+02
1716.lowfreq: -10.2737 -6.8677 -3.3908 -0.0010 -0.0006 -0.0002 18.6707 30.7844 39.8932
frequency: 18.6706 30.7793 39.8136 40.3278 49.2756 50.4507 53.1468 69.4608 79.6945 112.4031 144.3250 154.0148 167.1051 192.4493 200.3581 214.7039 241.1998 271.4530 300.2665 326.9488 332.5825 375.8389 378.9324 385.3405 385.5912 406.7186 410.9973 413.3919 414.9488 417.2796 470.3161 483.9364 489.3658 513.4690 530.3432 545.0636 565.0480 573.2427 588.8240 619.8816 624.9729 626.0281 633.9322 677.5142 706.5071 724.7264 724.7753 748.4902 765.9581 767.0826 788.0452 799.0655 817.2779 817.5903 818.9651 821.5163 821.7102 834.3141 840.3695 843.5099 855.1825 862.5702 943.6382 950.9894 951.3669 952.8902 963.4281 963.6307 966.0630 966.6273 969.7069 1004.4232 1004.8477 1005.1594 1007.4834 1104.3314 1106.6413 1107.2429 1107.6184 1126.0369 1155.4659 1156.0219 1156.1115 1159.6449 1202.8525 1203.8024 1204.6910 1204.8415 1211.7155 1276.8697 1286.3266 1294.0125 1295.5123 1296.1902 1307.9683 1352.6760 1360.0750 1361.1066 1362.5686 1405.5985 1406.0294 1406.1383 1406.5633 1482.7670 1489.2340 1489.6073 1492.7787 1543.8488 1586.0676 1586.7185 1587.6427 1590.3773 1602.3678 1603.8266 1604.6305 1607.3458 3143.8173 3143.9000 3144.4628 3144.6030 3151.8487 3151.9602 3152.1126 3152.2537 3174.1411 3174.1669 3174.2253 3174.2703 3177.4312 3177.6357 3177.7001 3177.7419
redmass: 9.8130 8.3864 6.7033 10.8794 9.8163 4.3686 4.7057 3.8798 3.7561 8.1158 7.2628 7.9124 8.1965 7.1731 8.5660 9.1669 7.7249 7.8372 8.1614 7.5671 7.4644 6.4235 6.1691 5.7617 5.6087 4.6819 2.9796 2.9859 2.9988 3.0012 7.3859 4.0674 3.8324 3.4161 2.7575 7.3532 4.2646 3.8844 6.9692 7.0064 7.1957 7.1775 6.8134 4.6635 4.5281 4.1035 4.1342 4.1630 6.6022 4.2422 6.4049 6.7776 2.5593 1.2525 1.2466 1.2421 1.3257 1.6441 1.5823 1.7281 2.4894 5.9381 1.7400 1.3473 1.3258 1.3417 1.3554 1.4556 1.3469 1.3496 2.7002 2.8289 2.9284 2.7205 2.4508 1.4408 1.3273 1.3309 1.3303 3.0203 1.5094 1.5211 1.5248 1.5425 1.7610 2.0127 1.9233 2.0453 5.5030 4.8623 1.8221 1.2850 1.2617 1.2662 2.2826 5.8035 7.8180 6.6600 5.6823 3.6824 3.4842 4.0352 3.8950 2.5272 2.6118 2.6639 2.6783 9.8937 7.5557 7.6360 7.7047 7.7108 6.2736 6.2783 6.5188 6.4250 1.0897 1.0896 1.0892 1.0892 1.0889 1.0889 1.0889 1.0889 1.0958 1.0958 1.0959 1.0959 1.0970 1.0970 1.0971 1.0971
irintensity: 0.0000 0.1143 0.6457 0.0110 0.5712 0.2007 0.0638 0.0052 0.0000 0.0515 0.0104 0.3160 0.0000 0.8576 0.2329 0.0000 7.2466 0.0000 4.8032 1.0431 0.0297 0.0000 4.4993 0.4975 0.0039 0.0000 0.0148 0.1470 1.4596 0.0000 10.8912 12.6117 0.0531 58.4577 0.0001 4.4547 55.2400 11.0483 0.0000 0.7310 0.0290 0.0000 0.3090 1.7695 0.1844 0.2428 0.0003 1.4190 56.8831 0.8953 9.3822 0.0004 81.4058 2.5607 0.0267 0.0016 6.0897 126.7742 0.0038 55.6378 25.4976 9.8990 1.9193 0.3202 0.0000 0.8679 0.0010 0.0544 1.0555 0.0003 6.2627 14.0043 0.0001 27.0793 0.0336 0.0004 0.1017 10.4575 26.5274 0.0003 5.2777 162.9443 104.5419 0.0006 61.6395 3.0213 112.2222 0.0290 21.8395 53.7670 1.4206 0.8016 0.0001 3.5319 7.3788 3.4030 0.4084 3.3914 0.0002 2.0738 5.8868 0.0215 0.6312 0.0005 153.8205 8.4153 285.1149 0.0000 3.2864 9.4132 7.9388 0.0007 2.9314 85.4099 0.0016 40.2988 7.9828 14.8171 0.5715 0.0749 8.5980 0.2353 10.0981 0.7367 6.9871 5.9747 2.9442 0.3600 7.1587 0.0175 4.1341 1.2339
temp: 298.150 k
press: 1.00000 atm
elementType: 9 9 9 9 6 6 6 6 6 6 6 6 6 6 6 6 6 6 6 6 6 6 6 6 6 6 6 6 6 6 1 1 1 1 1 1 1 1 1 1 1 1 1 1 1 1
symmnumber: 1
zpe: 882320.4 jmol-1
zpe.correction: 0.336058 hartree
zpe.thermalcorrener: 0.360671 hartree
zpe.thermalcorrenthalpy: 0.361616 hartree
zpe.thermalcorrgfe: 0.279382 hartree
zpe.sumelectzpe: -1397.693334 hartree
zpe.sumelectthermal: -1397.668720 hartree
zpe.sumelectthermalent: -1397.667776 hartree
zpe.sumelectthermalfe: -1397.750010 hartree
dipole: 0.0000 0.0000 -0.0089
dipole: 0.0089
quadrupole: -203.9996 -180.7152 -158.8658
quadrupole: 0.0415 0.0010 0.0000
quadrupole: -22.8061 0.4783 22.3277 0.0415 0.0010 0.0000
hfenergy: -1398.0293918 hartree
pointgroup: C01 [X(C26H16F4)]
dipole: 0.0000004 0.0000152 -0.003502 debye
polarizability: 363.4974108|-0.2647016|353.8510949|-0.0039764|-0.0325797|191.4568133 unknown
InChI: InChI=1S/C26H16F4/c27-21-9-1-17(2-10-21)25(18-3-11-22(28)12-4-18)26(19-5-13-23(29)14-6-19)20-7-15-24(30)16-8-20/h1-16H
charge 0 multiplicity 1
46 atoms
F  4.8031 3.715527 0.815791
F  -4.695317 3.852264 -0.807138
F  -4.801084 -3.714511 0.817369
F  4.69707 -3.851849 -0.805575
C  0.010949 0.697035 -0.004459
C  -0.009085 -0.696154 -0.004191
C  1.275875 1.47526 0.192499
C  -1.231239 1.51162 -0.198959
C  -1.273995 -1.474326 0.193071
C  1.233083 -1.51083 -0.198352
C  2.205292 1.109334 1.207258
C  -2.175889 1.17164 -1.208745
C  -2.203415 -1.108001 1.207678
C  2.177929 -1.171085 -1.208034
C  1.555768 2.630524 -0.590961
C  -1.4735 2.675644 0.584227
C  -1.553802 -2.629969 -0.589854
C  1.475104 -2.674759 0.585045
C  3.38417 1.849765 1.424458
C  -3.333863 1.945817 -1.420831
C  -3.382262 -1.848391 1.425202
C  3.33588 -1.945384 -1.419788
C  2.734419 3.380968 -0.396942
C  -2.630854 3.459673 0.395335
C  -2.732414 -3.380388 -0.395499
C  2.632424 -3.458916 0.396477
C  3.625958 2.96918 0.608674
C  -3.539087 3.072573 -0.605116
C  -3.623984 -2.968185 0.60992
C  3.540868 -3.072038 -0.603869
H  1.995318 0.23945 1.837119
H  -1.994192 0.295249 -1.838309
H  -1.993489 -0.237819 1.837145
H  1.996416 -0.294757 -1.837743
H  0.845971 2.939728 -1.365337
H  -0.751112 2.964907 1.35463
H  -0.843961 -2.939502 -1.36406
H  0.752542 -2.963858 1.355349
H  4.098912 1.575941 2.205689
H  -4.060202 1.692024 -2.198136
H  -4.097022 -1.574252 2.206305
H  4.062383 -1.691762 -2.196995
H  2.960911 4.262527 -1.003514
H  -2.82866 4.348089 1.001912
H  -2.958854 -4.262244 -1.00166
H  2.830038 -4.347263 1.003218
