program: Gaussian 09
title: 000280810
version: EM64L-G09RevD.01
frameworkgroup: C1[X(C9H8F3NO)]
method: RPBEPBE
basis: SDD
operation: Freq
keyword: #p
keyword: freq=noraman
keyword: PBEPBE/SDD
title: #p freq=noraman PBEPBE/SDD
converged: YES YES NO NO
title: Mulliken charges:
elementType: F F F O N C C C C C C C C C H H H H H H H H
charge: -0.164634 -0.166109 -0.168718 -0.426114 -0.106381 0.363521 0.296440 -0.472872 -0.351851 -0.357961 0.115361 -0.207706 0.241458 -0.800867 0.270893 0.279463 0.266792 0.238868 0.287870 0.243834 0.243734 0.374979
chargesum: 0.00000
title: Mulliken charges with hydrogens summed into heavy atoms:
elementType: F F F O N C C C C C C C C C
charge: -0.164634 -0.166109 -0.168718 -0.051135 -0.106381 0.363521 0.296440 -0.201979 -0.072388 -0.091169 0.115361 0.031162 0.241458 -0.025429
polarizability: 1.73004782e+02 6.32854021e+00 1.15383765e+02 -2.55081615e-01 1.06915965e-01 5.46150933e+01
1716.lowfreq: -9.5448 -4.8855 -0.0003 0.0005 0.0007 3.7001 17.9184 33.8920 106.8891
frequency: 16.7109 33.8784 106.8877 110.1995 138.1672 155.6013 208.5553 269.2004 274.2658 308.3456 329.2208 358.7995 385.1170 404.9619 430.7632 442.6546 478.0545 528.1172 535.7513 607.5675 636.6917 637.5458 698.6889 700.4908 798.6990 819.8296 896.1008 915.2906 943.2704 981.0482 983.6753 987.5265 1006.8375 1012.0820 1036.4661 1046.9055 1093.3729 1111.5260 1187.5001 1241.7830 1281.1034 1313.2451 1346.8845 1389.4635 1391.7059 1430.2292 1464.6355 1481.4868 1482.6607 1573.2490 1602.7988 1618.0573 2990.8124 3067.6910 3135.1762 3146.9319 3168.5971 3169.9318 3179.2455 3568.6001
redmass: 10.5538 4.1556 4.9022 6.7914 4.6931 1.1195 6.4413 8.5451 6.0820 6.7846 4.8785 5.3950 7.1816 1.8803 4.1754 5.4426 2.0577 8.7445 3.0814 11.9568 5.7137 5.4159 2.1765 4.9253 5.6974 1.4795 6.5822 1.5166 1.4135 2.3452 7.1311 6.0398 1.4232 5.2399 1.5920 5.3159 1.9778 1.7119 1.0917 1.8330 1.9896 1.3432 2.9054 1.5382 3.6707 3.4023 1.0939 1.0578 2.6019 5.0423 6.5624 6.0284 1.0393 1.0975 1.0965 1.0876 1.0925 1.0914 1.0989 1.0674
irintensity: 0.0687 0.6107 0.5241 1.3452 0.8999 0.0249 0.4262 0.9769 1.7351 1.5426 2.8919 4.1612 3.4158 67.6438 16.6590 9.7292 42.7133 1.9420 29.0343 23.9543 32.1618 6.5174 31.1794 19.2028 46.5984 62.2852 48.1521 39.2844 5.7625 129.7975 190.4990 17.2562 10.0122 143.6385 0.3754 144.1929 11.9864 6.7167 0.7001 264.4801 104.8694 15.9417 41.5024 39.3165 10.3335 24.6498 20.3555 22.1127 9.8793 10.3354 5.0309 1.4399 8.7342 11.6921 5.2515 6.3559 0.2349 2.0051 7.2240 84.2771
temp: 298.150 k
press: 1.00000 atm
elementType: 9 9 9 8 7 6 6 6 6 6 6 6 6 6 1 1 1 1 1 1 1 1
symmnumber: 1
zpe: 404700.6 jmol-1
zpe.correction: 0.154142 hartree
zpe.thermalcorrener: 0.167294 hartree
zpe.thermalcorrenthalpy: 0.168239 hartree
zpe.thermalcorrgfe: 0.112781 hartree
zpe.sumelectzpe: -776.196241 hartree
zpe.sumelectthermal: -776.183089 hartree
zpe.sumelectthermalent: -776.182144 hartree
zpe.sumelectthermalfe: -776.237602 hartree
dipole: -3.4060 1.6367 -0.1080
dipole: 3.7804
quadrupole: -79.8222 -72.1130 -83.8897
quadrupole: 2.4487 -0.4087 0.1352
quadrupole: -1.2139 6.4953 -5.2814 2.4487 -0.4087 0.1352
hfenergy: -776.350383 hartree
pointgroup: C01 [X(C9H8F3N1O1)]
dipole: -1.3351844 0.6513489 -0.0715248 debye
dipolederiv: -0.8349993 -0.121892 0.1870443 -0.0904875 -0.3942197 0.1025821 0.1406596 0.107868 -0.3792907 -0.5925181 0.1551425 -0.1742428 0.218161 -0.3764601 0.1324511 -0.2737741 0.1521317 -0.764607 -0.4441078 0.0863158 -0.0054291 0.1550715 -0.7373482 -0.2418839 -0.0257965 -0.1881661 -0.4142693 -1.4833916 -0.2160117 0.017143 -0.8061554 -0.1332787 -0.003115 0.0440279 -0.007351 -0.3821189 0.8624119 0.083215 -0.0122785 0.5605454 -0.2423431 -0.0019447 -0.0340122 0.0014356 -0.1718674 0.3524486 0.1396477 -0.0058383 0.1079585 -0.1593377 0.0077436 -0.0095248 0.0076029 0.0099049 -0.320908 0.1598752 -0.0005839 0.1263459 -0.1618208 -0.0055524 0.0788115 -0.0453591 -0.1489239 -0.106755 -0.116628 0.0013803 0.0934862 0.0075721 -0.0042115 -0.0179596 0.0129977 -0.1257655 -0.0399894 -0.0960947 0.0012941 -0.1161666 -0.032778 -0.0022179 0.002835 -0.0027859 -0.1118838 -0.0453018 0.0439475 -0.0038502 -0.1087343 -0.0157247 -0.0011746 -0.0171391 -0.000499 -0.1165767 0.078945 0.0719269 -0.0031235 0.2825896 0.4648864 -0.0206734 -0.0120635 -0.0209955 0.0041036 -0.120608 -0.0049983 -0.0014055 0.0390583 0.1875083 -0.0164965 -0.0065316 -0.0133292 -0.1357668 2.0491517 -0.2655318 -0.0031622 -0.4498681 1.4930737 0.0097216 0.1162386 -0.0466237 1.5447263 -0.1124797 0.0079859 0.0014927 -0.0799449 -0.2940144 0.0165723 0.0055049 0.0154514 0.1038604 0.1448526 0.001118 -0.0003836 -0.0102325 -0.0256912 0.0077441 0.001439 0.0036944 0.1429967 0.0356545 0.0825699 -0.0020018 0.0574666 0.0847438 0.0020361 -0.0010189 0.0023585 0.1503367 0.0045927 -0.0621481 0.0040207 -0.0543567 0.0842441 0.0032195 0.0081099 0.0057478 0.1616763 0.0751016 -0.0071646 0.0019184 -0.0152916 -0.103049 0.0112541 0.003919 0.0108976 0.1552669 -0.0287121 -0.1184381 0.006344 -0.0241135 0.1030667 0.001342 0.0025976 0.0024905 0.1276141 0.0661393 0.0570342 0.1006517 0.0529215 0.0681042 -0.0176435 0.0882285 -0.0503351 -0.0198285 0.0614365 0.0491108 -0.1065236 0.0456404 0.0726252 0.0092172 -0.0942278 0.0420803 -0.0217728 0.3990364 0.071018 -0.0024663 0.0161062 0.1102412 0.0110298 -0.0003235 0.0106883 0.3921855 unknown
polarizability: 173.0957641|5.8624642|115.1589803|-0.763163|-2.8330488|54.7488958 unknown
InChI: InChI=1S/C9H8F3NO/c1-6(13-14)7-3-2-4-8(5-7)9(10,11)12/h2-5,14H,1H3
charge 0 multiplicity 1
22 atoms
F  3.746664 0.121897 -0.447794
F  3.030693 -0.870227 1.457717
F  2.549497 -1.807438 -0.545341
O  -4.698514 -0.425869 0.145166
N  -3.461746 0.346839 0.100986
C  -1.085181 0.282353 0.082168
C  1.369824 0.234437 0.054282
C  0.131264 -0.445492 0.09681
C  -1.024984 1.706342 0.026495
C  1.42333 1.644336 -0.001144
C  -2.39273 -0.434526 0.123051
C  0.212449 2.373431 -0.016548
C  2.643323 -0.557802 0.119626
C  -2.435065 -1.945653 0.185071
H  0.124146 -1.538431 0.131122
H  -1.963015 2.26841 0.014503
H  2.388146 2.158297 -0.042037
H  0.240479 3.466776 -0.06307
H  -3.474097 -2.302322 0.210351
H  -1.931534 -2.386967 -0.694727
H  -1.912912 -2.313287 1.087562
H  -5.389236 0.285098 0.124049
