program: Gaussian 09
title: 000280820
version: EM64L-G09RevD.01
frameworkgroup: C1[X(C13H18NO4P)]
method: RPBEPBE
basis: SDD
operation: Freq
keyword: #p
keyword: freq=noraman
keyword: PBEPBE/SDD
title: #p freq=noraman PBEPBE/SDD
converged: YES YES NO NO
title: Mulliken charges:
elementType: P O O O O N C C C C C C C C C C C C C H H H H H H H H H H H H H H H H H H
charge: 1.402770 -0.545679 -0.509101 -0.505475 -0.604423 -0.032174 0.416315 0.377485 0.378481 0.137457 -0.590363 -0.625371 -0.808569 -0.806329 -0.255850 -0.216467 -0.645493 -0.656865 -0.278177 0.311409 0.266571 0.244712 0.244229 0.247375 0.247868 0.246059 0.236284 0.242039 0.229816 0.237606 0.232848 0.218499 0.232784 0.245123 0.210849 0.235349 0.238408
chargesum: 0.00000
title: Mulliken charges with hydrogens summed into heavy atoms:
elementType: P O O O O N C C C C C C C C C C C C C
charge: 1.402770 -0.545679 -0.509101 -0.505475 -0.604423 -0.032174 0.416315 0.377485 0.378481 0.137457 -0.278954 -0.358801 -0.072254 -0.076118 0.216005 0.253987 0.050913 0.027741 -0.278177
polarizability: 2.66564704e+02 9.41124793e+00 1.68546256e+02 4.59317344e+00 -1.83842840e+01 1.41006654e+02
1716.lowfreq: -17.3985 -12.6807 -6.3269 -0.0009 -0.0007 -0.0005 11.0634 16.5363 21.0221
frequency: 6.6363 14.4865 19.6973 27.7890 36.1776 44.8907 64.1574 68.3024 82.0066 101.8402 117.0390 137.4439 156.8951 175.8085 197.0266 213.5080 226.0679 230.6645 239.8530 245.5956 268.0727 273.6734 293.9566 341.7484 375.6353 386.1419 405.7179 448.6276 471.0198 499.9719 503.7896 527.5297 550.2411 595.9496 614.1118 624.2177 651.7544 701.2803 740.4316 748.6754 799.0881 810.1400 856.2114 880.2634 883.5273 898.7580 955.6381 956.9864 1004.6757 1011.3572 1024.6393 1044.3725 1046.0896 1047.1120 1055.9328 1090.7019 1107.6458 1128.6124 1131.0999 1140.2682 1189.6535 1248.2052 1250.6971 1270.6121 1305.7194 1353.2369 1354.1967 1362.0484 1391.5410 1396.5433 1401.9667 1403.0032 1429.7692 1437.6016 1457.1174 1459.2175 1463.4912 1464.9085 1466.6181 1479.0611 1479.1183 1480.6201 1484.3681 1488.4618 1574.8281 1608.2101 2164.3347 2984.5266 2985.0682 2987.9696 2996.5938 3009.6388 3018.1942 3062.3106 3062.3988 3075.6477 3079.4301 3088.9410 3093.6686 3098.1021 3100.6776 3110.9176 3115.7158 3153.2413 3165.6208
redmass: 3.7235 2.3815 3.7597 2.6926 4.1167 2.9950 3.4205 1.1182 5.8359 1.0582 5.1146 6.3874 3.0201 2.7745 3.9509 3.3534 3.0107 3.2537 1.9096 1.4640 3.1810 3.0084 6.0140 7.7614 4.2107 4.8146 5.0869 6.0288 5.7792 7.3653 5.2136 3.1123 7.8054 6.0665 4.2535 4.5553 6.1356 5.8910 7.6336 3.7195 1.1226 1.0879 3.8355 4.5883 1.3556 1.4601 3.3702 3.0728 2.5474 2.3621 1.8920 1.7664 1.5610 1.6082 10.5400 2.2288 2.2844 2.4375 1.4093 1.5705 2.7386 1.4051 1.1613 1.1178 5.9102 1.2187 1.2603 7.3309 1.2319 1.2437 1.2917 1.2191 2.4721 2.0414 1.0393 1.0440 1.0741 1.0462 1.0445 1.0760 1.0559 1.2305 1.3565 1.0869 8.6303 5.8982 12.6236 1.0377 1.0378 1.0361 1.0362 1.0569 1.0605 1.0970 1.0970 1.1082 1.1011 1.0997 1.0977 1.0994 1.0994 1.1053 1.1031 1.0935 1.0926
irintensity: 0.3096 0.6382 1.4524 0.4316 0.6700 4.1818 1.8836 2.0195 3.0526 0.6681 2.3146 4.9815 0.6370 5.9044 1.8159 6.2317 0.5366 3.6902 7.2360 0.5387 7.1566 4.0303 3.6834 37.4909 5.7244 20.9111 26.6085 9.6253 12.9213 6.7939 9.4726 0.1320 17.0286 18.2638 0.5693 38.3022 91.7985 95.8430 234.1157 6.0909 3.5022 2.4947 120.7148 264.6710 3.7638 61.3205 80.6575 12.9294 147.3247 150.3990 66.3137 3.2279 0.2206 19.4921 97.3717 8.4092 16.4710 113.5179 3.3808 8.7647 16.2955 5.4782 0.3729 0.6919 133.9116 8.7544 3.5282 3.5895 18.5248 26.6058 23.0393 13.2574 5.9293 2.2294 12.1401 13.4033 4.5501 17.7409 10.1829 8.0315 6.2303 35.1915 87.3691 8.5296 49.5219 188.8474 59.8845 18.4534 7.3972 10.6450 18.7475 20.9042 30.2714 2.7712 18.6271 6.7742 15.6713 20.9488 23.1090 17.0939 13.4181 26.4106 34.5728 0.6768 2.3975
temp: 298.150 k
press: 1.00000 atm
elementType: 15 8 8 8 8 7 6 6 6 6 6 6 6 6 6 6 6 6 6 1 1 1 1 1 1 1 1 1 1 1 1 1 1 1 1 1 1
symmnumber: 1
zpe: 755772.9 jmol-1
zpe.correction: 0.287859 hartree
zpe.thermalcorrener: 0.310804 hartree
zpe.thermalcorrenthalpy: 0.311748 hartree
zpe.thermalcorrgfe: 0.229807 hartree
zpe.sumelectzpe: -1201.599137 hartree
zpe.sumelectthermal: -1201.576192 hartree
zpe.sumelectthermalent: -1201.575248 hartree
zpe.sumelectthermalfe: -1201.657189 hartree
dipole: -3.9023 -1.1020 3.3565
dipole: 5.2639
quadrupole: -144.0993 -108.3599 -119.9645
quadrupole: 5.4138 -8.7847 2.2494
quadrupole: -19.9581 15.7813 4.1767 5.4138 -8.7847 2.2494
hfenergy: -1201.8869959 hartree
pointgroup: C01 [X(C13H18N1O4P1)]
dipole: 1.5746307 -0.5421172 -1.2310763 debye
polarizability: 260.6810368|-23.7767754|170.2047897|15.4083666|17.6168778|145.2317884 unknown
InChI: InChI=1S/C13H18NO4P/c1-5-16-19(15,17-6-2)18-12-7-10(3)13(9-14)11(4)8-12/h7-8H,5-6H2,1-4H3
charge 0 multiplicity 1
37 atoms
P  2.602454 0.248136 0.571206
O  1.26904 -0.862885 0.309801
O  2.982719 0.74545 -1.039112
O  3.799798 -0.890878 0.964057
O  2.40277 1.41078 1.628208
N  -5.331274 0.756887 -0.522575
C  -0.076597 -0.451213 0.148337
C  -2.004734 0.923328 0.740773
C  -2.209222 -0.898687 -0.955973
C  -2.782713 0.169777 -0.194439
C  -0.64079 0.599002 0.907872
C  -0.842719 -1.193923 -0.774673
C  -2.63448 2.042409 1.546434
C  -3.050406 -1.689238 -1.938382
C  2.977094 2.210901 -1.365823
C  4.119351 -2.022867 0.025767
C  1.590941 2.663042 -1.824061
C  5.281565 -2.769569 0.668841
C  -4.173613 0.489999 -0.37232
H  -0.025459 1.14757 1.62824
H  -0.361308 -1.996459 -1.340811
H  -1.896348 2.521229 2.209869
H  -3.063205 2.819361 0.886502
H  -3.466093 1.665737 2.170427
H  -3.894308 -2.189922 -1.428454
H  -3.49355 -1.030663 -2.708198
H  -2.450577 -2.460644 -2.448113
H  3.322891 2.781691 -0.484459
H  3.724482 2.285426 -2.172643
H  3.217172 -2.652329 -0.072262
H  4.385313 -1.596177 -0.958585
H  1.636183 3.715195 -2.162937
H  1.234815 2.042928 -2.664355
H  0.856628 2.60094 -1.001763
H  5.569829 -3.626753 0.03219
H  6.15623 -2.108002 0.784427
H  4.996319 -3.151883 1.663086
