program: Gaussian 09
title: 000280895
version: EM64L-G09RevD.01
frameworkgroup: C1[X(C10H14N6O6S)]
method: RPBEPBE
basis: SDD
operation: Freq
keyword: #p
keyword: freq=noraman
keyword: PBEPBE/SDD
title: #p freq=noraman PBEPBE/SDD
converged: YES YES NO NO
title: Mulliken charges:
elementType: S O O O O O O N N N N N N C C C C C C C C C C H H H H H H H H H H H H H H
charge: 1.152667 -0.290938 -0.421818 -0.489257 -0.385665 -0.494861 -0.514713 -0.199324 -0.079764 -0.193266 -0.059523 -0.602652 -0.734877 -0.166428 -0.124482 -0.052954 -0.088742 -0.356814 0.239298 -0.194338 -0.098273 0.173935 -0.327976 0.204359 0.295565 0.261155 0.280587 0.259161 0.255875 0.394422 0.363167 0.295714 0.254720 0.351247 0.340269 0.406926 0.347600
chargesum: 0.00000
title: Mulliken charges with hydrogens summed into heavy atoms:
elementType: S O O O O O O N N N N N N C C C C C C C C C C
charge: 1.152667 -0.290938 -0.027396 -0.126090 -0.385665 -0.494861 -0.514713 -0.199324 -0.079764 -0.193266 -0.059523 0.088863 0.019649 0.037931 0.171083 0.208201 0.191845 0.158221 0.239298 0.101376 -0.098273 0.173935 -0.073256
polarizability: 2.90988441e+02 3.07632255e+00 1.85393123e+02 1.26067951e+01 2.74797277e+00 1.22181257e+02
1716.lowfreq: -14.3583 -4.9641 -0.0023 -0.0018 -0.0017 2.9018 14.9905 24.6390 41.8870
frequency: 14.6401 24.4821 41.7860 46.5640 75.3629 82.8353 110.2414 122.5184 147.0375 166.2281 180.3516 181.4360 214.4477 223.0452 239.0819 251.4417 280.2836 283.5967 292.3962 301.3140 321.4148 332.8178 343.4860 362.4929 392.5985 411.9225 433.8139 478.4117 492.9837 520.0280 523.2808 534.7048 545.2305 556.3299 558.8194 577.0139 600.3554 622.1872 631.7638 642.3858 663.3060 711.5733 791.6538 792.6800 808.7670 840.8033 853.7013 867.9232 895.6854 905.4163 915.3953 931.5097 936.7118 962.3256 962.8553 981.9356 993.5190 1026.8951 1040.9195 1051.0412 1068.9892 1091.8503 1111.6928 1143.8518 1178.6262 1181.4921 1191.0931 1203.3138 1225.0634 1233.8118 1252.8694 1266.0930 1277.4697 1292.0384 1305.9023 1328.6715 1329.6323 1340.8874 1350.5663 1360.0691 1374.1132 1383.2393 1386.0667 1430.3486 1434.4216 1474.8185 1491.0117 1540.8737 1556.1950 1582.0513 1638.3080 2876.4058 2903.8752 2976.4958 3002.5726 3037.1486 3074.4518 3090.8506 3110.3940 3174.0434 3262.5630 3534.3794 3534.9493 3573.7355 3688.5480
redmass: 8.9389 6.2598 5.3957 7.1525 6.4685 6.3236 5.3863 7.3716 6.7126 5.6414 6.8435 4.8867 6.1252 6.1881 2.8506 2.3182 3.5732 4.1778 4.4171 4.3726 4.8006 5.2227 10.8057 4.0436 1.7071 3.3299 5.5541 5.9482 5.5790 8.8540 4.2494 3.8268 1.4296 1.6491 1.4898 4.3692 6.7930 4.0647 5.3620 4.5982 9.2360 7.3514 7.6976 5.0117 3.3374 1.4961 2.5717 6.7758 1.1217 2.5152 5.4257 1.4205 4.9041 2.9182 3.8872 5.1588 5.2393 5.4862 3.1741 4.2016 3.7256 3.3753 2.7056 4.1242 1.3862 1.6091 1.2937 1.2475 2.3857 1.2788 1.5780 1.2419 1.8722 2.6076 1.9942 1.2785 2.4921 1.5739 1.3521 1.4356 1.9374 1.6201 2.8126 1.1151 2.9526 3.9904 1.3082 8.4520 1.0731 1.8064 2.8556 1.0762 1.0755 1.0848 1.0574 1.0871 1.1062 1.0848 1.0650 1.0927 1.0992 1.0838 1.0469 1.0660 1.1056
irintensity: 0.6380 2.2861 3.2536 4.1470 6.0734 1.2923 9.4217 5.3208 1.0793 25.7036 14.9293 9.8661 6.5669 1.3551 10.9195 44.1903 12.7627 15.9395 47.6774 14.6657 2.5260 19.4228 14.3650 7.5228 104.6723 10.8460 24.5702 95.1851 79.3678 9.5532 2.3125 34.3001 175.0626 26.9190 31.5661 3.2387 19.4475 68.0917 20.1862 38.8023 22.4577 24.7175 6.9454 15.7991 26.0665 20.2908 9.7817 6.0783 133.6350 130.5502 15.9522 3.7957 7.4023 14.1897 182.1761 193.9008 120.5821 10.1546 20.7930 18.8657 26.5948 42.9428 3.8810 24.7587 12.4108 68.2061 9.8720 83.7176 56.1111 13.0952 41.3157 9.5180 119.9657 28.3248 18.8546 2.0321 14.2197 38.2654 91.0431 13.0418 30.2750 28.3627 19.0969 20.7332 59.8144 29.2555 159.8998 43.0509 54.4230 31.0243 658.3690 627.7714 583.5953 28.0265 9.6990 7.8910 7.1761 33.7744 568.8634 8.8586 5.0815 181.1587 89.0149 15.0042 55.5233
temp: 298.150 k
press: 1.00000 atm
elementType: 16 8 8 8 8 8 8 7 7 7 7 7 7 6 6 6 6 6 6 6 6 6 6 1 1 1 1 1 1 1 1 1 1 1 1 1 1
symmnumber: 1
zpe: 699585.7 jmol-1
zpe.correction: 0.266458 hartree
zpe.thermalcorrener: 0.288317 hartree
zpe.thermalcorrenthalpy: 0.289261 hartree
zpe.thermalcorrgfe: 0.214133 hartree
zpe.sumelectzpe: -1565.445963 hartree
zpe.sumelectthermal: -1565.424104 hartree
zpe.sumelectthermalent: -1565.423160 hartree
zpe.sumelectthermalfe: -1565.498289 hartree
dipole: -6.3457 0.3529 -0.3148
dipole: 6.3633
quadrupole: -153.2495 -145.7008 -142.5740
quadrupole: 18.5361 8.0266 -5.3347
quadrupole: -6.0747 1.4740 4.6007 18.5361 8.0266 -5.3347
hfenergy: -1565.7124212 hartree
pointgroup: C01 [X(C10H14N6O6S1)]
dipole: -2.4941455 0.1652708 -0.1396404 debye
polarizability: 291.7600264|3.4192619|170.8982807|5.7881854|-26.7812816|135.9045136 unknown
InChI: InChI=1S/C10H14N6O6S/c11-8-5-9(14-2-13-8)16(3-15-5)10-7(18)6(17)4(22-10)1-21-23(12,19)20/h2-4,6-7,10,17-18H,1,11-12H2
charge 0 multiplicity 1
37 atoms
S  5.411615 -0.604275 -0.369806
O  0.714804 -0.957726 0.942378
O  -0.128379 2.293139 -0.58164
O  2.533122 0.91142 -1.666041
O  4.290285 0.167513 0.978934
O  6.920696 -0.648126 0.181248
O  4.634737 -1.927204 -0.880243
N  -1.566244 -0.39737 0.584258
N  -3.359849 -1.812671 0.806291
N  -2.715077 1.528272 -0.512385
N  -5.103741 1.10361 -0.853713
N  -6.154622 -0.909563 -0.208906
N  5.307173 0.647989 -1.595375
C  0.281669 0.921002 -0.527198
C  1.811624 0.781588 -0.393051
C  -0.210779 0.160379 0.738745
C  2.015248 -0.611415 0.270906
C  3.122457 -0.647334 1.34812
C  -2.665706 0.279311 0.049977
C  -2.043028 -1.645775 1.029651
C  -3.76189 -0.610114 0.196193
C  -5.023222 -0.15116 -0.286968
C  -3.974559 1.859894 -0.93576
H  -0.061282 0.334196 -1.415719
H  2.204959 1.5965 0.234322
H  -0.195291 0.845709 1.612061
H  2.208022 -1.380346 -0.498752
H  3.414068 -1.68774 1.579481
H  2.762401 -0.161879 2.275124
H  -1.155408 2.278489 -0.641088
H  2.033894 0.460068 -2.391748
H  -1.376582 -2.374578 1.481524
H  -4.087478 2.846105 -1.393955
H  -6.115708 -1.839547 0.204259
H  -7.029547 -0.532423 -0.568657
H  4.304672 0.911239 -1.759902
H  5.997047 1.393721 -1.438963
