program: Gaussian 09
title: 000280822
version: EM64L-G09RevD.01
frameworkgroup: C1[X(C12H17BrNO4P)]
method: RPBEPBE
basis: SDD
operation: Freq
keyword: #p
keyword: freq=noraman
keyword: PBEPBE/SDD
title: #p freq=noraman PBEPBE/SDD
converged: YES YES NO NO
title: Mulliken charges:
elementType: Br P O O O O N C C C C C C C C C C C C H H H H H H H H H H H H H H H H H
charge: 0.020001 1.414548 -0.499238 -0.522029 -0.493290 -0.589270 -0.062719 0.330831 0.136596 -0.217899 -0.261028 -0.351122 -0.334359 -0.793407 -0.194498 -0.186945 -0.659537 -0.648456 -0.209581 0.227461 0.234462 0.239723 0.229990 0.246292 0.284926 0.295429 0.244994 0.239875 0.252412 0.255037 0.208721 0.238045 0.231299 0.217139 0.226147 0.249450
chargesum: 0.00000
title: Mulliken charges with hydrogens summed into heavy atoms:
elementType: Br P O O O O N C C C C C C C C C C C C
charge: 0.020001 1.414548 -0.499238 -0.522029 -0.493290 -0.589270 -0.062719 0.330831 0.136596 0.244025 0.208685 -0.104830 -0.049433 -0.013109 0.057914 0.068092 0.018528 0.044280 -0.209581
polarizability: 3.31085186e+02 1.21133948e+01 1.65527430e+02 5.27982462e+00 -1.75904367e+01 1.36437629e+02
1716.lowfreq: -4.8266 -1.4213 -0.0012 -0.0011 0.0004 2.5722 11.2386 24.2493 29.2234
frequency: 11.1435 24.2284 29.1636 30.8887 44.5591 53.4652 59.9465 61.9537 77.6140 111.6056 131.1462 150.9300 157.9113 176.7326 185.2601 226.3889 232.2495 245.6992 251.7354 262.6686 287.9269 298.3357 323.2538 345.1918 374.7981 400.8330 406.4353 429.3962 454.6219 466.2383 476.2333 561.1582 586.5552 622.6568 634.9616 693.5743 718.9021 720.4387 795.9914 800.4861 813.3876 821.5725 829.5948 849.0968 869.9809 879.2525 960.5510 976.6307 992.1414 993.8043 1011.6059 1018.4646 1038.6898 1059.2066 1067.2015 1085.5125 1092.5260 1106.7536 1119.9055 1130.6499 1143.8452 1193.5474 1256.8331 1271.3778 1298.4233 1317.3280 1353.6807 1356.1704 1357.2845 1385.1897 1393.1614 1395.8216 1396.5297 1453.2072 1456.8760 1461.1690 1464.6521 1476.6634 1477.3669 1479.9011 1480.5078 1485.8312 1547.4863 1581.6843 1597.4717 2987.7336 2993.1956 2994.4534 2999.2515 3018.1192 3064.3583 3073.0499 3080.7132 3087.3516 3092.3030 3111.4644 3112.5042 3132.7973 3152.5028 3159.3293 3173.9775 3178.7838
redmass: 4.6407 3.4789 3.7556 4.7134 3.3905 2.5616 2.9713 3.4606 4.8307 6.5718 4.5744 8.2586 1.1164 3.0050 3.8939 2.9235 2.6680 2.0685 1.7094 3.9768 3.9495 3.9626 7.4564 5.4971 5.4644 4.3319 3.0361 5.7677 4.7852 3.6480 5.5835 2.8247 6.5351 7.0369 6.4815 6.7025 3.6056 8.6644 4.8285 1.1352 1.1265 6.5191 1.3433 1.4063 3.6977 4.3596 1.3508 2.2869 1.8534 2.4617 2.7262 2.8720 1.5927 3.3695 9.8053 2.1398 2.1728 2.3120 1.3802 1.4147 1.5561 1.1227 1.1487 1.1146 1.2678 3.8504 1.2156 1.3493 3.3768 1.4478 1.2296 1.2542 2.8085 1.1492 1.0397 1.0568 1.0599 2.1247 1.1090 1.0737 1.0553 1.0765 5.4036 7.1759 6.2729 1.0360 1.0389 1.0390 1.0538 1.0612 1.1081 1.0970 1.1005 1.0994 1.0979 1.1053 1.1025 1.0975 1.0880 1.0887 1.0963 1.0977
irintensity: 0.8817 0.9565 1.0621 0.2615 0.8551 1.4366 3.4243 0.3829 3.5671 0.6380 2.2912 0.8882 1.2595 6.2189 2.3465 1.1056 2.1319 7.4932 1.2978 7.3360 3.7415 26.1445 4.6060 9.8118 44.9374 20.2861 3.5769 21.6565 24.1632 18.9033 25.2858 16.1917 13.3631 8.4507 233.5703 116.2334 1.6756 195.9527 149.9719 12.8046 1.7331 435.7831 27.0988 35.2023 39.7353 172.3264 0.1208 27.0268 22.6591 32.3599 177.0561 86.6534 0.5894 32.3652 103.8997 18.1325 9.2621 24.9607 4.8314 3.5546 8.9349 2.5216 3.7777 0.0687 0.7249 60.0795 20.6200 2.6793 0.3294 27.4795 27.6673 32.8356 30.3673 10.0458 10.1954 8.2917 9.9845 53.0422 7.5774 20.4485 11.5682 9.0185 4.5767 5.8997 41.3944 15.6879 12.6979 17.9574 25.5577 31.4232 13.0714 9.9097 20.7467 20.1049 24.9423 28.6077 38.5325 6.3027 4.7070 0.4188 8.0591 1.2717
temp: 298.150 k
press: 1.00000 atm
elementType: 35 15 8 8 8 8 7 6 6 6 6 6 6 6 6 6 6 6 6 1 1 1 1 1 1 1 1 1 1 1 1 1 1 1 1 1
symmnumber: 1
zpe: 718559.1 jmol-1
zpe.correction: 0.273685 hartree
zpe.thermalcorrener: 0.296243 hartree
zpe.thermalcorrenthalpy: 0.297188 hartree
zpe.thermalcorrgfe: 0.216648 hartree
zpe.sumelectzpe: -1176.296899 hartree
zpe.sumelectthermal: -1176.274340 hartree
zpe.sumelectthermalent: -1176.273396 hartree
zpe.sumelectthermalfe: -1176.353935 hartree
dipole: -1.3053 -1.0539 4.2915
dipole: 4.6078
quadrupole: -118.5652 -119.4097 -134.3165
quadrupole: -3.4739 -5.7567 -1.4696
quadrupole: 5.5319 4.6874 -10.2193 -3.4739 -5.7567 -1.4696
hfenergy: -1176.5705837 hartree
pointgroup: C01 [X(C12H17Br1N1O4P1)]
dipole: 0.4027031 0.3029196 1.7413915 debye
polarizability: 324.9394041|33.7556241|167.9401088|1.294051|20.9816784|140.1707319 unknown
InChI: InChI=1S/C12H17BrNO4P/c1-4-16-19(15,17-5-2)18-14-10(3)11-6-8-12(13)9-7-11/h6-9H,4-5H2,1-3H3
charge 0 multiplicity 1
36 atoms
Br -6.583121 -1.487548 -0.701545
P  2.638385 0.454028 -0.450135
O  2.631881 -1.22468 -0.098812
O  3.840263 1.15703 0.569914
O  1.298177 1.155903 0.469167
O  2.752367 0.769406 -1.994987
N  0.033493 0.472176 0.086512
C  -2.329976 0.47816 0.297353
C  -1.007977 1.093197 0.61416
C  2.38994 -1.702927 1.301094
C  5.059698 1.728479 -0.085985
C  -3.517273 0.967783 0.903894
C  -2.4339 -0.607278 -0.620314
C  -0.924738 2.331397 1.478957
C  -4.774723 0.393586 0.614894
C  -3.680494 -1.188184 -0.917678
C  2.725416 -3.190566 1.292344
C  6.060168 0.63564 -0.467269
C  -4.842095 -0.681144 -0.292995
H  3.036533 -1.1350 1.996315
H  1.328742 -1.51923 1.548605
H  4.751169 2.319081 -0.968289
H  5.456847 2.402841 0.689986
H  -3.475896 1.801668 1.611145
H  -1.526663 -0.984191 -1.101257
H  0.113415 2.686475 1.542203
H  -1.557217 3.13613 1.063321
H  -1.285042 2.11617 2.502128
H  -5.681407 0.778787 1.089563
H  -3.748923 -2.018268 -1.626339
H  2.544201 -3.620794 2.295004
H  2.094612 -3.725342 0.562617
H  3.783302 -3.352251 1.025531
H  6.986185 1.098736 -0.85703
H  6.323922 0.019901 0.409871
H  5.650729 -0.020571 -1.255342
