program: Gaussian 09
title: 000280874
version: EM64L-G09RevD.01
frameworkgroup: C1[X(C28H21ClN2)]
method: RPBEPBE
basis: SDD
operation: Freq
keyword: #p
keyword: freq=noraman
keyword: PBEPBE/SDD
title: #p freq=noraman PBEPBE/SDD
converged: YES YES NO NO
title: Mulliken charges:
elementType: Cl N N C C C C C C C C C C C C C C C C C C C C C C C C C C C C H H H H H H H H H H H H H H H H H H H H H
charge: -0.054761 -0.329511 -0.084051 -0.048940 0.190770 0.134320 -0.674510 0.335239 0.320997 0.411231 0.506353 -0.398471 -0.444694 -0.387820 -0.358229 -0.329065 -0.385927 -0.398370 -0.417663 -0.228017 -0.242700 -0.213218 -0.214619 -0.249352 -0.220938 -0.211385 -0.121112 -0.223871 -0.224495 -0.246569 -0.249779 0.222727 0.235996 0.245965 0.242980 0.265584 0.266170 0.266675 0.271343 0.246414 0.230401 0.228127 0.227126 0.257751 0.257687 0.229384 0.231145 0.230305 0.222050 0.223555 0.231899 0.225872
chargesum: 0.00000
title: Mulliken charges with hydrogens summed into heavy atoms:
elementType: Cl N N C C C C C C C C C C C C C C C C C C C C C C C C C C C C
charge: -0.054761 -0.329511 -0.084051 -0.048940 0.190770 0.134320 -0.215787 0.335239 0.320997 0.411231 0.506353 -0.152506 -0.201714 -0.122236 -0.092058 -0.062390 -0.114583 -0.151956 -0.187262 0.000109 -0.015573 0.044533 0.043068 -0.019968 0.010206 0.018919 -0.121112 -0.001821 -0.000939 -0.014669 -0.023907
polarizability: 3.78091718e+02 2.96761782e+01 3.76648523e+02 1.20341286e+01 2.11110542e+01 2.32239038e+02
1716.lowfreq: -10.0724 -2.5957 0.0012 0.0018 0.0020 4.7264 10.1766 10.4093 22.9690
frequency: 6.8302 10.0491 22.8935 29.9981 35.6680 37.0259 47.2646 56.1487 70.6961 76.0952 111.1132 126.8598 138.4669 184.7685 194.2931 204.6474 228.8688 237.1011 260.1256 281.3917 308.8304 323.6314 357.5238 399.6831 402.0127 405.6451 407.5475 412.2327 417.2034 431.5363 458.5907 489.5204 502.8525 507.1589 524.7992 576.6171 610.0940 614.1289 614.7383 617.0703 627.0031 661.1658 663.4685 680.8591 695.0281 703.8405 707.0135 708.1736 718.2482 735.7656 749.6101 764.9696 770.5682 812.8027 822.0232 828.9305 837.4691 842.2394 853.8491 856.2073 908.8017 916.1764 924.5680 938.4947 953.8281 955.1125 969.6797 973.1024 976.5631 978.8770 987.7080 988.7942 990.2592 992.8145 994.0006 995.9417 997.4006 1001.1628 1023.0213 1026.9510 1037.4638 1066.6759 1071.9216 1078.6109 1080.9635 1089.3640 1110.2848 1132.7320 1165.7673 1171.7365 1172.4851 1172.6048 1185.4232 1187.6109 1188.0889 1190.6393 1200.6070 1211.8966 1294.4951 1295.1694 1310.5979 1314.5803 1323.1400 1333.8407 1342.0776 1363.8236 1369.0386 1383.3414 1385.0780 1396.0957 1418.3935 1429.3413 1440.3564 1445.9017 1451.1276 1458.9915 1468.9578 1482.9843 1490.5938 1497.5616 1549.5056 1575.9650 1582.2495 1594.8473 1596.2283 1603.5966 1610.2366 1612.9923 1617.0249 3008.8354 3070.4369 3116.8360 3119.7569 3120.2516 3127.8792 3132.2840 3132.9861 3139.9876 3143.0830 3143.1883 3149.4095 3149.7466 3153.3387 3160.1320 3161.0260 3164.6703 3172.7985 3173.0123 3177.0515 3180.5559
redmass: 4.5657 4.8340 6.1498 6.3770 5.8458 4.2502 4.3882 4.8232 4.0375 5.7797 4.9834 5.9820 6.3750 5.2384 5.8462 7.0204 5.0759 5.7425 6.6395 5.6928 2.8145 4.0511 4.0622 6.0095 2.8237 2.8841 2.9108 2.9200 5.9643 6.2495 4.2039 4.5739 4.1851 3.2343 3.9676 5.2158 5.5113 6.4682 5.7069 6.0759 6.1222 7.0511 6.7216 5.5571 2.1443 2.0173 1.8624 4.0093 5.1039 2.5846 3.1441 1.7087 1.9627 3.6337 3.3623 1.3082 1.6306 1.2687 1.2495 1.2433 1.6141 1.4110 1.4219 1.8280 7.2005 1.3766 1.3743 1.3854 1.3924 1.4060 5.5437 6.0582 5.5114 1.3152 1.3857 1.6797 3.0550 4.1412 2.4414 2.2357 1.9840 2.4615 2.8810 1.6712 1.6060 2.0365 1.4297 2.7989 1.3678 1.0876 1.0550 1.0542 1.1213 1.1278 1.1241 1.1183 2.9179 3.9999 1.3876 1.2912 2.2616 1.4264 1.5126 1.5469 3.9116 6.6659 5.8792 8.0322 8.5568 3.5314 3.2279 2.7857 2.2336 2.4309 3.1379 1.1530 2.6774 2.1668 2.9244 3.5231 7.4220 7.6286 6.0897 6.1240 6.6106 6.4494 6.1564 6.0823 6.4209 1.0611 1.0999 1.0850 1.0877 1.0854 1.0871 1.0852 1.0918 1.0925 1.0962 1.0900 1.0893 1.0960 1.0891 1.0948 1.1015 1.1015 1.0964 1.0962 1.0974 1.0982
irintensity: 0.0049 0.0188 0.1011 0.0624 0.3091 0.2125 0.6783 0.3174 0.0539 0.3981 0.5650 1.1495 0.5243 0.2405 2.1905 0.2871 0.8601 0.1698 1.1520 0.0505 1.5792 0.9509 1.4424 2.1025 0.0161 0.1089 0.3657 0.2230 2.0686 5.6705 18.7474 3.2367 7.6038 7.4996 3.6540 7.7568 8.9853 1.1022 9.0855 3.7005 7.0256 16.7470 1.3576 20.4125 33.2255 62.0356 48.5262 11.3224 22.3794 12.6348 12.7655 83.4243 38.1125 9.6523 0.9908 8.7007 52.7329 2.4414 0.4906 0.1517 2.7141 4.2571 5.9409 2.2782 39.8332 0.4617 0.1155 1.6821 0.4407 0.3544 1.4042 0.0818 0.1261 0.2891 1.0336 4.7287 14.1568 38.3918 14.3953 7.5111 1.0572 2.7011 50.3285 3.3659 13.1634 4.2584 10.8059 10.8683 7.2489 1.2722 0.0310 0.1327 0.9976 1.0621 1.3201 0.3379 0.9197 1.4829 0.3859 1.3351 2.7422 0.9557 3.0465 10.9023 36.9792 55.3169 5.2479 1.0344 2.3344 8.7686 27.6121 10.7468 9.1862 6.6265 17.8588 15.5857 63.1195 23.1125 149.3908 40.6289 22.0797 6.1561 2.8140 0.8746 2.4742 5.8990 67.5577 9.0429 7.0128 21.5939 9.3201 6.4359 0.4595 4.9804 0.2677 0.6945 14.2214 19.2658 36.1323 14.4025 5.4459 33.5802 3.9617 38.1743 27.2556 20.6665 4.6777 9.5325 0.4843 3.8199
temp: 298.150 k
press: 1.00000 atm
elementType: 17 7 7 6 6 6 6 6 6 6 6 6 6 6 6 6 6 6 6 6 6 6 6 6 6 6 6 6 6 6 6 1 1 1 1 1 1 1 1 1 1 1 1 1 1 1 1 1 1 1 1 1
symmnumber: 1
zpe: 1063028.5 jmol-1
zpe.correction: 0.404886 hartree
zpe.thermalcorrener: 0.430516 hartree
zpe.thermalcorrenthalpy: 0.431460 hartree
zpe.thermalcorrgfe: 0.343350 hartree
zpe.sumelectzpe: -1647.038205 hartree
zpe.sumelectthermal: -1647.012576 hartree
zpe.sumelectthermalent: -1647.011632 hartree
zpe.sumelectthermalfe: -1647.099741 hartree
dipole: 0.1167 -0.1199 -0.0698
dipole: 0.1812
quadrupole: -188.1176 -173.7370 -178.9203
quadrupole: 16.6596 -2.5460 10.6408
quadrupole: -7.8593 6.5213 1.3380 16.6596 -2.5460 10.6408
hfenergy: -1647.4430916 hartree
pointgroup: C01 [X(C28H21Cl1N2)]
dipole: 0.0434503 0.0521569 0.0218239 debye
polarizability: 380.2867067|-28.4227791|372.8763232|-24.7117038|16.3241736|233.8162487 unknown
InChI: InChI=1S/C28H21ClN2/c29-24-18-16-23(17-19-24)28-27(22-12-6-2-7-13-22)26(20-21-10-4-1-5-11-21)30-31(28)25-14-8-3-9-15-25/h1-19H,20H2
charge 0 multiplicity 1
52 atoms
Cl 5.256256 3.459486 -1.945458
N  0.815515 -1.429223 0.491032
N  -0.405577 -1.935958 0.956748
C  -0.518907 0.367842 0.739169
C  0.775257 -0.036545 0.335762
C  -1.206485 -0.842934 1.105085
C  -2.650046 -1.033287 1.509799
C  -1.084733 1.738909 0.716495
C  1.877583 0.78325 -0.210539
C  1.909063 -2.351235 0.352619
C  -3.606076 -1.067772 0.312005
C  -1.059831 2.524173 -0.468132
C  -1.67495 2.29589 1.884104
C  2.244235 1.99657 0.431769
C  2.560958 0.409515 -1.400577
C  3.228138 -1.982643 0.712122
C  1.632782 -3.6625 -0.105099
C  -3.498646 -2.098478 -0.657016
C  -4.614653 -0.085754 0.154864
C  -1.608413 3.824435 -0.484811
C  -2.228187 3.595284 1.867159
C  3.267292 2.816427 -0.089536
C  3.589142 1.21637 -1.931147
C  -2.197494 4.366016 0.681715
C  4.273516 -2.921591 0.577552
C  2.684113 -4.594811 -0.22573
C  3.927985 2.410508 -1.264892
C  -4.385855 -2.15007 -1.754098
C  -5.503325 -0.133246 -0.944719
C  4.009637 -4.228328 0.106769
C  -5.393328 -1.167029 -1.901893
H  -2.959815 -0.230293 2.199799
H  -2.716405 -1.988952 2.06232
H  -0.619443 2.104237 -1.379002
H  -1.674658 1.717197 2.815401
H  1.725692 2.30154 1.345971
H  2.285093 -0.513123 -1.920886
H  3.434912 -0.983609 1.105008
H  0.601337 -3.933903 -0.344532
H  -2.71404 -2.8569 -0.545713
H  -4.700077 0.723248 0.89085
H  -1.582053 4.412189 -1.409239
H  -2.673566 4.008432 2.779378
H  3.544423 3.748598 0.410486
H  4.110688 0.924131 -2.846806
H  -2.624659 5.374915 0.667411
H  5.292745 -2.632814 0.856127
H  2.467105 -5.608415 -0.58001
H  -4.294724 -2.954985 -2.492727
H  -6.277226 0.635287 -1.05324
H  4.823998 -4.954153 0.009127
H  -6.082193 -1.2064 -2.753345
