program: Gaussian 09
title: 000280788
version: EM64L-G09RevD.01
frameworkgroup: C1[X(C12H15NO3)]
method: RPBEPBE
basis: SDD
operation: Freq
keyword: #p
keyword: freq=noraman
keyword: PBEPBE/SDD
title: #p freq=noraman PBEPBE/SDD
converged: YES YES NO NO
title: Mulliken charges:
elementType: O O O N C C C C C C C C C C C C H H H H H H H H H H H H H H H
charge: -0.333837 -0.243871 -0.229107 -0.171489 -0.237243 0.589979 -0.691136 -0.691605 -0.493571 -0.484497 0.360746 -0.188686 -0.420968 0.326675 -0.603842 -0.056211 0.207367 0.220699 0.213762 0.225570 0.225579 0.213977 0.219855 0.302218 0.239528 0.231591 0.255687 0.268055 0.253538 0.253709 0.237527
chargesum: 0.00000
title: Mulliken charges with hydrogens summed into heavy atoms:
elementType: O O O N C C C C C C C C C C C C
charge: -0.333837 -0.243871 -0.229107 -0.171489 -0.029876 0.589979 -0.031104 -0.032194 -0.191352 -0.244968 0.360746 0.042906 -0.165282 0.326675 0.171460 0.181316
polarizability: 2.08272105e+02 -4.38464783e+00 1.59148934e+02 -4.96451434e-01 8.19114225e-02 8.35426079e+01
1716.lowfreq: -0.0009 -0.0004 -0.0004 2.9769 6.4876 8.0296 13.5019 36.2540 55.8377
frequency: 10.7088 36.1844 55.7558 79.1730 81.9790 98.3779 119.7411 143.0535 175.9511 216.0665 234.2300 245.3740 263.1432 297.8230 318.4370 323.8828 337.3467 338.5465 358.8691 456.7003 457.3903 503.9510 558.0089 590.8698 611.2856 688.9278 702.2122 706.5130 736.1352 800.7749 815.3818 856.3555 905.1642 911.1390 920.6881 928.0780 957.6920 979.7622 982.4377 986.8288 1009.8433 1073.6093 1082.1902 1095.6128 1114.1088 1131.9145 1135.6713 1162.1770 1177.2573 1231.0299 1269.5788 1285.9288 1287.9232 1307.1694 1335.3878 1379.1603 1380.6015 1387.0512 1399.7229 1427.5002 1439.1057 1467.7379 1469.1722 1471.6944 1476.7423 1478.7588 1480.8247 1490.2720 1596.5125 1607.0193 1609.2967 1652.0610 2976.5771 2978.8232 2983.3519 3015.3651 3063.9854 3070.9533 3077.2944 3078.2924 3082.8445 3111.3206 3128.1622 3136.5979 3149.8756 3172.9361 3197.6395
redmass: 6.4442 2.8355 4.6549 4.7790 5.1160 1.0305 3.2445 5.2384 4.4758 1.0523 1.4597 4.6753 2.1608 2.8656 3.3568 3.3066 4.9746 2.8192 6.4454 3.0875 3.0964 9.5719 3.0150 7.5377 4.5267 10.5032 5.6431 2.0454 6.3124 1.5205 5.5223 3.7305 1.3889 2.7557 1.2463 1.3657 1.4291 1.3621 1.5903 5.9897 2.6077 1.5402 1.6530 2.3350 2.5680 1.3049 2.2656 1.8192 1.2180 2.2352 2.7708 4.9627 1.7590 1.3246 1.6397 1.2954 1.1922 4.8107 1.2605 1.1939 2.4564 1.0443 1.0519 2.0527 1.0426 1.0708 1.0486 1.1815 6.2367 6.9359 7.5599 9.4690 1.0348 1.0361 1.0834 1.0327 1.0907 1.1001 1.0993 1.1006 1.0997 1.1029 1.0878 1.1025 1.0926 1.0980 1.0915
irintensity: 0.0149 0.0011 0.2664 0.1816 1.3468 0.1572 0.9942 1.1821 10.6386 0.0424 1.8746 2.8228 3.3592 0.0008 0.2415 4.9459 12.6297 15.3959 17.0325 4.8691 2.5270 1.1017 0.3028 9.9944 0.0971 14.0295 3.5653 39.3302 17.7954 44.6168 25.1905 46.1498 0.1583 30.9666 16.2819 8.4641 0.3517 0.1968 4.0081 7.3610 27.0392 47.2916 14.9639 283.0986 1.1180 0.0070 239.9261 97.2179 18.0388 143.9111 566.7946 98.6211 20.1979 0.4723 0.8653 20.3141 15.7337 17.0646 12.3176 100.2551 43.3913 0.5353 5.5900 32.9602 19.8308 15.1584 19.2373 40.4845 76.3910 2.2083 534.8767 68.3028 31.7170 28.2324 19.6823 23.2569 15.4602 0.0342 98.1068 24.6941 38.6289 16.3645 8.0814 0.6166 20.9967 8.1584 4.0256
temp: 298.150 k
press: 1.00000 atm
elementType: 8 8 8 7 6 6 6 6 6 6 6 6 6 6 6 6 1 1 1 1 1 1 1 1 1 1 1 1 1 1 1
symmnumber: 1
zpe: 651531.7 jmol-1
zpe.correction: 0.248155 hartree
zpe.thermalcorrener: 0.264795 hartree
zpe.thermalcorrenthalpy: 0.265739 hartree
zpe.thermalcorrgfe: 0.201754 hartree
zpe.sumelectzpe: -745.517810 hartree
zpe.sumelectthermal: -745.501171 hartree
zpe.sumelectthermalent: -745.500226 hartree
zpe.sumelectthermalfe: -745.564211 hartree
dipole: 3.1362 -0.0121 -0.0109
dipole: 3.1363
quadrupole: -102.6754 -89.7276 -96.7521
quadrupole: 8.6277 0.5265 -0.3646
quadrupole: -6.2904 6.6574 -0.3671 8.6277 0.5265 -0.3646
hfenergy: -745.7659651 hartree
pointgroup: C01 [X(C12H15N1O3)]
dipole: -1.2293351 -0.0959219 0.0454641 debye
polarizability: 207.1516821|9.0053074|154.2299195|-4.8200204|19.8958567|89.582045 unknown
InChI: InChI=1S/C12H15NO3/c1-9(2)10-5-4-6-11(7-10)16-12(15)13(3)8-14/h4-9H,1-3H3
charge 0 multiplicity 1
31 atoms
O  1.159674 0.680366 0.093782
O  1.285579 -1.608006 -0.506966
O  5.06912 1.12559 -0.07133
N  3.210007 -0.289252 -0.302996
C  -3.638189 -0.98855 -0.150783
C  -2.592353 0.09572 0.125502
C  -3.478105 -2.193857 0.814111
C  -3.600209 -1.456171 -1.630298
C  -1.210107 -0.19207 -0.036454
C  -2.984704 1.390353 0.543401
C  -0.265357 0.820741 0.2234
C  -2.019003 2.391879 0.799305
C  -0.647341 2.114544 0.640499
C  1.813999 -0.502382 -0.258727
C  4.049888 -1.456061 -0.662154
C  3.827003 0.95631 -0.026398
H  -4.635344 -0.540366 0.033968
H  -2.502426 -2.693185 0.668229
H  -4.27102 -2.942629 0.631509
H  -3.539629 -1.873102 1.869626
H  -3.747677 -0.607702 -2.322495
H  -4.395016 -2.201211 -1.819674
H  -2.630683 -1.928244 -1.874467
H  -0.878639 -1.181713 -0.353428
H  -4.050179 1.61573 0.668938
H  -2.333638 3.389972 1.122206
H  0.119842 2.87055 0.830619
H  5.097001 -1.118742 -0.64803
H  3.7814 -1.824867 -1.665188
H  3.901338 -2.270697 0.064747
H  3.103567 1.749151 0.229047
