program: Gaussian 09
title: 000280782
version: EM64L-G09RevD.01
frameworkgroup: C1[X(C8H9ClN4O4)]
method: RPBEPBE
basis: SDD
operation: Freq
keyword: #p
keyword: freq=noraman
keyword: PBEPBE/SDD
title: #p freq=noraman PBEPBE/SDD
converged: NO YES NO NO
title: Mulliken charges:
elementType: Cl O O O O N N N N C C C C C C C C H H H H H H H H H
charge: 0.003818 -0.283748 -0.260108 -0.258019 -0.256139 -0.458558 0.020787 0.037334 -0.605074 0.429824 0.095544 0.083717 -0.206188 -0.313200 0.262961 -0.218753 -0.668647 0.333632 0.386319 0.233935 0.233785 0.379056 0.343275 0.215705 0.234401 0.234342
chargesum: 0.00000
title: Mulliken charges with hydrogens summed into heavy atoms:
elementType: Cl O O O O N N N N C C C C C C C C
charge: 0.003818 -0.283748 -0.260108 -0.258019 -0.256139 -0.072239 0.020787 0.037334 0.117257 0.429824 0.095544 0.083717 0.127445 -0.313200 0.262961 0.248967 0.015801
polarizability: 2.29699730e+02 3.74833535e+00 1.93832457e+02 -6.94255771e-02 2.78564397e-03 6.37232950e+01
1716.lowfreq: -0.0023 -0.0018 -0.0015 3.6311 3.9037 4.5033 39.4329 47.5753 67.1505
frequency: 39.2655 47.5489 67.1241 72.4794 78.8042 99.6942 135.1599 161.6250 195.1354 217.3903 221.0899 247.4859 265.2294 304.0169 313.8148 327.5579 360.6066 381.5287 407.2001 490.0311 544.9210 566.1876 592.7588 603.4175 641.7081 646.9829 673.8183 703.5925 717.9080 723.4857 763.3928 772.0923 800.7204 845.7144 879.5814 907.6034 926.3130 961.8612 977.4202 1027.7544 1071.5701 1111.7999 1121.6793 1138.5974 1150.4384 1165.9866 1221.7180 1251.8447 1254.7168 1324.6195 1360.6217 1369.6082 1399.7876 1405.0799 1463.5586 1474.8790 1478.9881 1487.6253 1515.8969 1554.2553 1567.7958 1586.0569 1647.8342 3000.2791 3013.7581 3074.1318 3096.2830 3113.7267 3212.7038 3226.6043 3422.8438 3632.3000
redmass: 3.4494 5.2162 3.2286 5.1986 9.8832 6.8347 4.0556 7.4103 6.7044 6.9690 3.7458 1.4286 7.1946 8.0846 12.1721 9.3440 4.8264 4.2036 6.5702 10.7039 7.5032 4.6652 1.7958 6.0623 7.7197 2.8795 6.2235 9.3402 6.7622 1.1454 5.8024 7.8501 1.0996 4.6262 1.3335 6.4047 1.1149 6.0914 3.1192 2.7362 4.1747 2.6125 3.9137 1.4636 2.5879 2.2560 4.1087 1.1297 5.6135 5.3126 1.6958 2.6134 2.7822 1.3186 1.0394 1.0796 3.2641 1.0860 2.2044 3.9112 2.8543 3.7583 7.4859 1.0362 1.0582 1.1072 1.0983 1.1027 1.0941 1.0798 1.0508 1.0998
irintensity: 0.8617 0.9442 1.0847 0.9750 2.2361 0.1421 3.8086 1.4745 9.0504 14.1635 0.0655 1.5297 0.0902 0.5000 10.6449 2.6285 8.6157 6.2377 15.8684 26.2230 2.4585 3.3372 77.7756 5.4997 3.0117 79.5424 18.1169 10.1625 2.9500 89.5294 32.6161 3.9839 3.2459 38.0292 41.4025 65.7893 113.8625 46.0048 11.2966 134.1553 67.4562 69.6486 111.3324 5.1407 234.0715 140.0001 512.1397 0.1497 401.2710 281.1244 12.1502 173.1087 56.0426 14.6967 12.8386 15.9503 6.1395 14.4880 184.4876 657.7821 196.5274 907.5382 134.9327 18.8774 19.6054 8.0677 26.1169 39.6254 24.0311 194.9089 96.8748 106.0373
temp: 298.150 k
press: 1.00000 atm
elementType: 17 8 8 8 8 7 7 7 7 6 6 6 6 6 6 6 6 1 1 1 1 1 1 1 1 1
symmnumber: 1
zpe: 476278.9 jmol-1
zpe.correction: 0.181405 hartree
zpe.thermalcorrener: 0.197600 hartree
zpe.thermalcorrenthalpy: 0.198544 hartree
zpe.thermalcorrgfe: 0.136217 hartree
zpe.sumelectzpe: -1288.912542 hartree
zpe.sumelectthermal: -1288.896347 hartree
zpe.sumelectthermalent: -1288.895403 hartree
zpe.sumelectthermalfe: -1288.957730 hartree
dipole: 1.4456 0.2839 0.0073
dipole: 1.4732
quadrupole: -80.2666 -123.3699 -104.5250
quadrupole: -11.7550 -0.0038 0.0065
quadrupole: 22.4539 -20.6494 -1.8045 -11.7550 -0.0038 0.0065
hfenergy: -1289.093947 hartree
pointgroup: C01[X(C8H9Cl1N4O4)]
dipole: -0.5505942 -0.1810759 0.000886 debye
dipolederiv: -0.1889375 -0.2203884 0.0018019 -0.2420195 -0.9777583 0.0098395 0.0020716 0.0101186 -0.0639816 -2.1564206 -0.2331375 -0.0110226 -0.5391006 -0.5155468 -0.0009511 -0.0047056 0.0016976 -0.2977167 -0.8257526 0.059919 -0.0048844 0.2188101 -0.8564579 0.0103853 -0.006845 0.008601 -0.3251878 -0.9311168 -0.3490865 -0.0007321 -0.1487634 -0.6287677 0.0037011 -0.0044707 0.0010793 -0.2583071 -0.6141547 0.4659641 -0.0090271 0.2638308 -0.8598794 0.0100359 -0.005676 0.0105442 -0.2669067 -2.4716592 0.1363961 -0.0201201 0.5091063 -0.5904187 0.0084245 -0.0259119 0.0052835 -0.2961238 -0.8356691 0.367476 -0.0101238 0.809041 -1.2446128 0.0203192 -0.015699 0.0164614 -0.2164513 1.0895215 0.1012158 0.005807 0.0926427 1.8749815 -0.0206439 0.0064534 -0.0191982 0.2063084 -1.1369218 0.3791559 -0.0094737 0.635064 -0.550474 0.0047097 -0.0130012 0.0025237 -0.6151248 1.5993629 -0.2841767 0.0159406 0.8891404 0.8728723 -0.0014612 0.0004338 -0.0112587 0.1681696 -0.60629 0.0116485 -0.0050352 -0.1706748 -1.157951 0.0127913 -0.0029878 0.014852 -0.0314542 1.1186709 -0.1100229 0.009177 -0.8520597 1.0377229 -0.0178268 0.0186422 -0.0114517 0.2295444 -0.9815617 -0.3732616 -0.0022172 -0.821494 -0.7951129 0.0012877 0.0036182 0.0050544 -0.1530598 1.6060776 0.1882827 0.0111124 0.0973882 1.865824 -0.0231287 0.0124349 -0.0223627 0.0296348 3.0522586 -0.0028405 0.0219935 -0.3364723 1.2660948 -0.0179607 0.0259524 -0.0143485 0.3208441 1.2385039 0.0420722 0.0064608 -0.1921311 0.2339198 0.0000734 0.0087105 0.001643 0.3527929 -0.1318337 -0.0844935 0.000432 -0.0486164 -0.0055789 0.0014458 -0.0000151 0.0011271 0.0568314 0.1918315 0.0177424 -0.0002742 0.0076586 0.1116681 0.0011217 -0.0001743 0.0011992 0.1944108 0.3470163 -0.0269988 0.0004031 -0.265747 0.3853101 -0.0030393 0.0037935 -0.0011141 0.3202629 -0.0732285 -0.0306882 -0.0238181 0.0690088 -0.0007297 -0.0890165 0.0122003 -0.1000279 -0.0503936 -0.0747054 -0.0307896 0.0242082 0.0674447 0.0067044 0.0880996 -0.0152585 0.0978919 -0.0586459 0.3343357 -0.0848228 0.0007111 -0.0198232 0.2583701 0.0012951 0.0000746 0.0007483 0.3781562 0.3495513 -0.0461866 0.0004155 -0.029093 0.2018257 0.0019358 0.0001694 0.0017682 0.371337 -0.1505099 0.0628114 -0.002999 0.085956 0.0442444 0.0019843 -0.003384 0.001863 0.1198501 0.1254632 0.0234614 0.0376109 -0.0388538 0.0075604 -0.1004254 0.012909 -0.1100551 -0.0527251 0.126168 0.0207483 -0.0363465 -0.0402428 0.0161895 0.0970038 -0.0093345 0.1073606 -0.0620645 unknown
polarizability: 228.2226864|8.0462927|195.2770927|1.2703026|-1.6606198|63.7557033 unknown
InChI: InChI=1S/C8H9ClN4O4/c1-2-17-8(14)11-4-3-5(9)12-7(10)6(4)13(15)16/h3,11H,2,10H2,1H3
charge 0 multiplicity 1
26 atoms
Cl 2.418896 3.670847 -0.004186
O  -3.299869 -0.262255 0.000021
O  -2.250207 1.837665 -0.023374
O  -0.149763 -2.639632 0.055316
O  2.07971 -3.044763 0.078743
N  -1.050329 -0.222617 0.016809
N  3.006643 1.048868 0.035148
N  1.08655 -2.194387 0.061266
N  3.813536 -1.112251 0.070152
C  0.275307 0.201311 0.022634
C  1.350911 -0.781189 0.044848
C  2.72402 -0.294872 0.050221
C  0.61725 1.576833 0.007611
C  1.984069 1.904161 0.01523
C  -2.194297 0.584425 -0.004273
C  -4.634715 0.414678 -0.021668
C  -5.685179 -0.68962 -0.004297
H  -0.162728 2.336261 -0.009225
H  -1.177298 -1.255114 0.030003
H  -4.698146 1.077216 0.860169
H  -4.688088 1.039637 -0.931182
H  3.669105 -2.127637 0.081925
H  4.729601 -0.664131 0.072243
H  -6.695558 -0.241913 -0.019085
H  -5.583873 -1.345942 -0.884878
H  -5.593348 -1.308283 0.90413
