program: Gaussian 09
title: 000280778
version: EM64L-G09RevD.01
frameworkgroup: C1[X(C8H14N2O)]
method: RPBEPBE
basis: SDD
operation: Freq
keyword: #p
keyword: freq=noraman
keyword: PBEPBE/SDD
title: #p freq=noraman PBEPBE/SDD
converged: YES YES NO NO
title: Mulliken charges:
elementType: O N N C C C C C C C C H H H H H H H H H H H H H H
charge: -0.321143 -0.420182 -0.414616 -0.085974 -0.417169 -0.427682 -0.441580 -0.256624 -0.176082 0.313165 -0.605276 0.260211 0.235305 0.201523 0.195858 0.212368 0.212663 0.218334 0.229036 0.203326 0.283220 0.285132 0.218081 0.218873 0.279231
chargesum: 0.00000
title: Mulliken charges with hydrogens summed into heavy atoms:
elementType: O N N C C C C C C C C
charge: -0.321143 -0.136962 -0.129484 0.174237 0.019660 -0.019456 -0.010583 -0.027588 0.027244 0.313165 0.110909
polarizability: 1.41163591e+02 9.62247621e-01 8.29449299e+01 -2.96301783e+00 -2.38734814e+00 8.48995606e+01
1716.lowfreq: -11.7368 -6.6692 -0.0007 -0.0007 -0.0006 1.3861 29.3118 60.5187 73.4626
frequency: 29.0550 60.5058 73.4498 119.0110 135.2260 171.0557 239.5973 242.8018 297.7054 315.2154 386.7203 420.9257 447.7315 514.6478 520.9916 563.9464 668.8495 711.3542 717.2486 734.9804 819.7030 847.5339 881.4914 913.7658 951.7829 976.6726 981.6947 1005.3366 1070.2907 1082.5507 1097.6966 1126.3465 1129.9228 1135.6756 1143.8112 1177.4593 1219.1376 1232.6294 1249.5546 1300.8196 1324.0222 1329.9772 1335.4112 1360.3892 1384.7057 1419.4712 1441.2508 1450.9582 1462.9558 1466.9384 1473.2383 1487.9326 1521.8257 1627.6486 1666.0066 2954.6143 2967.5579 2973.7844 2985.2139 3010.4129 3016.1161 3041.6376 3043.0924 3061.4899 3092.3652 3103.7704 3125.4904 3546.2971 3562.0141
redmass: 3.7389 3.3351 3.2556 1.1901 2.7797 3.4526 2.1742 3.0129 2.9940 1.2320 2.8369 2.8337 2.4510 1.4009 2.7031 3.1933 2.8837 6.8170 2.2523 1.6453 3.4778 1.7399 2.2364 2.5863 2.6495 2.8386 1.2376 2.5279 1.8553 2.2758 1.8156 1.2769 1.5110 1.0594 1.6865 2.0640 1.5775 1.2716 1.2468 1.5888 1.4789 1.4466 1.4803 1.3988 1.5785 1.1698 1.5253 1.0880 1.0931 1.3075 1.1410 1.0487 1.6054 5.1992 6.6502 1.0639 1.0355 1.0656 1.0640 1.0933 1.0835 1.1027 1.0991 1.0995 1.0842 1.0968 1.0988 1.0777 1.0770
irintensity: 3.7854 8.7072 3.9174 0.5271 4.5850 2.2886 0.1467 1.9485 15.7065 3.6627 14.1697 0.2682 6.5743 182.9303 60.4611 2.8680 20.6677 7.7748 1.7476 31.9498 4.0541 5.4880 7.8412 17.5449 13.5854 0.9191 2.0553 5.4033 8.8387 6.7488 4.1778 1.7185 36.3972 0.3782 2.6079 20.2132 179.2380 9.8769 18.2725 32.8478 12.1986 3.3766 7.7518 2.2911 0.0943 33.0788 51.0107 7.9605 29.5895 262.1968 67.1791 17.0571 298.5668 183.3393 3.6638 39.3328 108.6172 25.7290 24.9403 47.2153 9.3825 47.6307 62.7455 38.3039 9.6201 1.7242 48.0786 11.1641 11.1009
temp: 298.150 k
press: 1.00000 atm
elementType: 8 7 7 6 6 6 6 6 6 6 6 1 1 1 1 1 1 1 1 1 1 1 1 1 1
symmnumber: 1
zpe: 561954.7 jmol-1
zpe.correction: 0.214037 hartree
zpe.thermalcorrener: 0.225814 hartree
zpe.thermalcorrenthalpy: 0.226758 hartree
zpe.thermalcorrgfe: 0.175340 hartree
zpe.sumelectzpe: -497.115793 hartree
zpe.sumelectthermal: -497.104016 hartree
zpe.sumelectthermalent: -497.103072 hartree
zpe.sumelectthermalfe: -497.154490 hartree
dipole: 1.0787 1.2023 -3.9206
dipole: 4.2403
quadrupole: -59.9161 -66.3455 -67.5797
quadrupole: -3.0565 7.9047 -0.3937
quadrupole: 4.6977 -1.7317 -2.9660 -3.0565 7.9047 -0.3937
hfenergy: -497.3298303 hartree
pointgroup: C01 [X(C8H14N2O1)]
dipole: 0.4509663 -0.3124553 1.5754783 debye
dipolederiv: -0.8543378 0.0385152 -0.0752177 0.0709048 -0.4239655 0.1693975 -0.1133232 0.1502954 -0.9745528 -1.7061682 0.0059101 0.0071452 0.2800829 -0.5574046 0.0244402 -0.1574434 0.0019701 -0.2807385 -1.2783805 -0.0625503 0.3505085 -0.0571736 -0.5136748 -0.0532808 0.5596554 -0.0496703 -0.5851763 0.6440204 0.1256362 -0.1649482 -0.0090089 0.2773794 -0.0713454 -0.4847906 0.0181061 0.2558935 -0.021694 -0.0016954 -0.0341936 -0.0388152 -0.0276085 0.0183152 0.027949 -0.0327128 0.1068648 0.0582892 -0.0048158 -0.0572618 0.0130881 0.0878847 -0.0235557 -0.0558203 0.0013625 0.0699694 -0.0041839 -0.0333556 -0.0613543 -0.0006238 -0.0498643 -0.031019 0.0021895 -0.0129403 0.1980837 -0.0216822 -0.1064487 0.1302835 -0.1066608 0.0564681 0.0304823 0.1840304 0.0334304 -0.213352 0.0302477 0.0475818 0.1161413 0.1239429 0.1959943 0.0385448 0.0576379 0.0137343 -0.1915231 2.3839901 -0.0779219 -0.190072 -0.1478744 0.340029 -0.262216 -0.1616748 -0.243008 1.3372654 0.6395303 0.0009899 -0.0915281 -0.1000391 0.2758055 0.1039614 0.1515502 0.0783974 -0.0070881 0.0535425 -0.0375814 -0.069292 -0.0221215 0.0484505 -0.0100207 0.0305288 -0.0454989 -0.0284726 -0.0410067 0.1271426 -0.035537 0.1226541 -0.038716 0.0063377 -0.0215766 -0.007503 0.0656707 -0.0501831 -0.0546673 0.1151873 -0.0621916 0.0622361 -0.0028248 0.0921879 0.0225748 -0.1219316 -0.0054164 0.031034 0.1191865 0.0094584 0.0673762 0.06232 0.0977984 0.0064603 -0.1304819 0.0090834 -0.0922936 -0.0199141 -0.0972867 -0.1886668 -0.0362533 -0.0203955 -0.0165112 0.0783235 -0.0055303 0.0192183 -0.1079223 -0.007055 0.0402666 0.004266 -0.1779762 -0.0144512 -0.1035521 -0.0369349 -0.0258873 0.0943609 -0.1122727 0.0033686 0.0139844 0.1546106 0.0382467 -0.0226277 0.0742987 -0.0513754 -0.0491063 -0.0165933 -0.1475567 -0.0306153 -0.0678232 -0.0286764 0.1280022 -0.0225858 0.1139557 -0.0451787 0.1113523 -0.1061802 0.0093962 -0.072555 0.0166141 0.1280341 0.1302306 0.0300694 -0.0067817 0.0031724 0.3089888 0.0298221 0.0178189 0.0514148 0.0513239 0.0806847 0.0528011 -0.0386563 0.0538267 0.3242106 0.0837692 -0.0567261 0.0791211 0.1019194 -0.0871028 0.0530137 0.0583076 0.13252 -0.046918 -0.1365813 0.0981337 -0.1379155 0.0115634 -0.1529121 -0.0873361 0.0387803 -0.1652715 -0.1026718 0.0268177 0.0239753 0.026244 0.1165208 0.1842011 -0.0099392 0.0170633 0.0219856 0.1147688 0.0358577 -0.1079614 0.0509155 0.0100622 unknown
polarizability: 141.2420887|0.2949659|82.4924557|2.3273892|-2.1034912|85.2735369 unknown
InChI: InChI=1S/C8H14N2O/c1-9-8(11)10-7-5-3-2-4-6-7/h3,5,7,9-10H,2,4,6H2,1H3
charge 0 multiplicity 1
25 atoms
O  -2.142387 0.286143 -1.276006
N  -0.562498 -0.363373 0.321659
N  -2.839593 -0.214422 0.906811
C  0.579824 -0.249777 -0.616288
C  1.218732 1.166172 -0.620985
C  2.162884 1.367006 0.58422
C  3.325862 0.347711 0.532933
C  1.600777 -1.326627 -0.284004
C  2.836083 -1.054781 0.217942
C  -1.865608 -0.073642 -0.087015
C  -4.252737 0.049357 0.627005
H  0.148962 -0.436098 -1.618543
H  0.410759 1.91914 -0.634864
H  1.795098 1.286641 -1.560516
H  1.591543 1.229104 1.524946
H  2.559955 2.399245 0.600186
H  3.883038 0.341984 1.491013
H  4.061015 0.657246 -0.240872
H  1.295671 -2.364862 -0.472161
H  3.533276 -1.88418 0.405348
H  -0.357063 -0.619589 1.288285
H  -2.574681 -0.536149 1.83778
H  -4.655373 0.848737 1.277901
H  -4.872549 -0.859558 0.75018
H  -4.318395 0.379672 -0.422355
