program: Gaussian 09
title: 000280770
version: EM64L-G09RevD.01
frameworkgroup: C1[X(C9H14N4O4)]
method: RPBEPBE
basis: SDD
operation: Freq
keyword: #p
keyword: freq=noraman
keyword: PBEPBE/SDD
title: #p freq=noraman PBEPBE/SDD
converged: YES YES NO NO
title: Mulliken charges:
elementType: O O O O N N N N C C C C C C C C C H H H H H H H H H H H H H H
charge: -0.414319 -0.238299 -0.397615 -0.271043 -0.357002 -0.626319 -0.425839 -0.059284 -0.409428 -0.354994 -0.151168 -0.396583 0.151055 0.228139 0.181957 0.178249 -0.466607 0.222166 0.223069 0.208265 0.242549 0.260160 0.218455 0.251482 0.301423 0.282744 0.312793 0.321255 0.240702 0.379930 0.364111
chargesum: 0.00000
title: Mulliken charges with hydrogens summed into heavy atoms:
elementType: O O O O N N N N C C C C C C C C C
charge: -0.034389 -0.238299 -0.033504 -0.271043 -0.055580 -0.030783 -0.104584 -0.059284 0.035806 0.095819 0.108992 0.073354 0.151055 0.228139 0.181957 0.178249 -0.225904
polarizability: 1.75164974e+02 1.08671156e+01 1.43311857e+02 2.64585322e+01 -3.79384631e+00 1.07096663e+02
1716.lowfreq: -4.9646 0.0003 0.0005 0.0007 3.0103 8.4848 15.8090 22.8461 33.2311
frequency: 15.4807 22.6794 33.1814 49.4113 65.0105 98.8718 141.3366 171.2431 179.5164 192.5583 207.8960 216.2502 226.2624 276.9842 297.8278 330.8604 352.8260 383.9198 418.4435 438.5326 473.8622 483.1069 498.5390 515.9636 520.5798 573.1232 589.6672 616.7811 633.1141 648.8549 659.3735 697.5735 717.5264 724.9537 749.0129 787.1760 803.3787 849.5853 908.1033 922.3134 932.1130 1001.3894 1041.1293 1047.1686 1053.7238 1066.3117 1102.1611 1143.3160 1172.0055 1187.9458 1197.4662 1204.8411 1214.9604 1233.8779 1261.0516 1269.6608 1291.3858 1303.6966 1311.1802 1361.0752 1373.9189 1387.5827 1390.2141 1447.0826 1454.7575 1461.4689 1475.1271 1522.4856 1542.8766 1595.2015 1608.0126 1660.1534 1668.7963 2969.0546 2981.1466 2986.2135 3005.2660 3033.1230 3055.3448 3080.8853 3179.6392 3498.4781 3508.1605 3517.8691 3576.2734 3577.3847 3638.8139
redmass: 6.3310 5.6296 8.9753 6.9924 5.0900 3.4219 2.7152 4.0026 5.6299 4.9380 5.1894 1.3369 2.5258 3.2917 3.2773 2.2570 3.4360 1.5909 2.8909 1.1230 3.9237 1.6802 6.8872 7.3365 2.6235 2.6414 6.0157 1.5988 1.7956 3.8283 3.0897 2.3488 4.4692 3.7474 1.2008 2.3982 3.2402 1.7087 3.6781 3.8219 3.9029 2.9659 3.3091 3.4934 1.8897 2.3976 2.7523 1.5707 1.3360 1.8781 2.7182 3.3135 1.5859 1.3404 1.5391 1.5709 1.2438 1.2260 1.1536 1.3506 1.4050 1.9406 1.9676 1.3336 1.9374 1.0916 1.0998 4.0934 3.2821 5.0055 1.3229 7.2495 3.8578 1.0725 1.0682 1.0646 1.0625 1.0981 1.1000 1.1049 1.0932 1.0451 1.0777 1.0640 1.0670 1.0763 1.1003
irintensity: 0.7069 0.1935 0.5207 0.7846 0.4824 0.6452 0.3614 0.1563 1.7163 8.7327 22.3598 37.3351 6.6328 6.0978 7.4704 11.8740 17.5758 42.1490 147.1852 91.1612 40.7416 213.4388 7.4090 2.0069 15.3677 68.3394 15.5334 146.0135 134.9336 5.0090 8.8673 13.9254 29.8429 2.2976 8.3828 94.9002 1.4484 2.3480 12.0424 12.9888 5.2539 50.8162 157.8032 78.8525 104.9657 36.1212 56.3183 9.4574 70.9241 4.2698 41.7516 8.5867 128.4678 23.4632 21.8971 49.9505 29.6034 2.5979 42.0590 0.8925 16.1133 0.3204 13.1725 24.5528 201.6725 3.4642 14.3308 14.1892 138.7687 831.1879 247.8502 571.9792 153.2067 14.8667 16.2849 50.4269 53.6708 6.3197 23.5745 27.2630 1.4779 9.4471 26.2292 29.2652 74.0062 23.4507 15.8963
temp: 298.150 k
press: 1.00000 atm
elementType: 8 8 8 8 7 7 7 7 6 6 6 6 6 6 6 6 6 1 1 1 1 1 1 1 1 1 1 1 1 1 1
symmnumber: 1
zpe: 634520.1 jmol-1
zpe.correction: 0.241676 hartree
zpe.thermalcorrener: 0.259357 hartree
zpe.thermalcorrenthalpy: 0.260301 hartree
zpe.thermalcorrgfe: 0.193418 hartree
zpe.sumelectzpe: -869.977444 hartree
zpe.sumelectthermal: -869.959763 hartree
zpe.sumelectthermalent: -869.958819 hartree
zpe.sumelectthermalfe: -870.025702 hartree
dipole: -2.6063 -2.1993 -2.8209
dipole: 4.4257
quadrupole: -122.6647 -83.9946 -108.5110
quadrupole: 20.5072 -1.6583 4.2765
quadrupole: -17.6080 21.0622 -3.4542 20.5072 -1.6583 4.2765
hfenergy: -870.2191201 hartree
pointgroup: C01 [X(C9H14N4O4)]
dipole: -1.0237008 -0.3640882 1.360631 debye
polarizability: 174.2251642|15.9026232|126.8549752|-25.5139688|17.3628123|124.4933547 unknown
InChI: InChI=1S/C9H14N4O4/c10-5(8(16)17)2-1-3-11-9-12-6(14)4-7(15)13-9/h4-5,11-12,15-16H,1-3,10H2
charge 0 multiplicity 1
31 atoms
O  -5.336219 0.378588 0.475806
O  -4.265723 1.487283 -1.260312
O  2.582323 -1.897492 -1.968073
O  4.800352 1.993107 -0.024934
N  0.631166 0.440097 1.53464
N  -3.130831 -0.888834 -2.139727
N  2.729813 1.189888 0.713091
N  1.63893 -0.710601 -0.242852
C  -2.719583 -1.127626 0.378247
C  -1.594253 -0.076266 0.458657
C  -3.727381 -0.890507 -0.806546
C  -0.535401 -0.465709 1.515238
C  -4.44312 0.439625 -0.600258
C  1.671499 0.294386 0.647058
C  3.884642 1.128206 -0.162836
C  2.711279 -0.821382 -1.090451
C  3.817364 0.034126 -1.105299
H  -2.272843 -2.130149 0.22047
H  -3.29232 -1.170855 1.325267
H  -2.010798 0.923536 0.693215
H  -1.090545 -0.003429 -0.522896
H  -4.49951 -1.682088 -0.723175
H  -0.975059 -0.470637 2.530463
H  -0.160746 -1.48073 1.296319
H  0.613084 1.250243 2.153265
H  -2.426505 -1.605031 -2.31766
H  -2.92508 0.035333 -2.525275
H  2.760572 1.94699 1.403038
H  4.650921 -0.08086 -1.802314
H  -5.773419 1.265768 0.58922
H  3.371394 -1.95108 -2.564685
