program: Gaussian 09
title: 000280781
version: EM64L-G09RevD.01
frameworkgroup: C1[X(C13H21FN2O)]
method: RPBEPBE
basis: SDD
operation: Freq
keyword: #p
keyword: freq=noraman
keyword: PBEPBE/SDD
title: #p freq=noraman PBEPBE/SDD
converged: NO YES NO NO
title: Mulliken charges:
elementType: F O N N C C C C C C C C C C C C C H H H H H H H H H H H H H H H H H H H H H
charge: -0.258484 -0.321162 -0.445376 -0.415784 -0.127186 -0.117518 -0.087593 -0.078164 -0.064460 -0.467884 -0.492265 -0.468784 -0.493658 -0.467119 0.286927 -0.364559 -0.194512 0.216974 0.222540 0.198674 0.198160 0.264048 0.195727 0.208805 0.185282 0.206872 0.208991 0.196203 0.205320 0.190883 0.198652 0.198630 0.279533 0.297535 0.257537 0.231969 0.200599 0.214649
chargesum: 0.00000
title: Mulliken charges with hydrogens summed into heavy atoms:
elementType: F O N N C C C C C C C C C C C C C
charge: -0.258484 -0.321162 -0.165844 -0.118249 0.089787 0.105021 0.111080 0.119997 0.199588 -0.063351 -0.100111 -0.063589 -0.097455 -0.069837 0.286927 0.124947 0.220736
polarizability: 1.86171827e+02 -1.31042222e+00 1.36192732e+02 -2.79509426e+00 -2.33051474e+00 1.23466446e+02
1716.lowfreq: -41.4986 -18.9378 -4.9949 -0.0006 -0.0004 0.0005 9.7796 17.5354 48.9694
frequency: -18.5445 -10.0740 48.3363 67.4873 88.1069 106.2730 179.2588 237.1084 265.2682 274.4243 304.5091 321.2723 344.4896 372.5858 380.2315 422.5896 426.2925 440.6293 447.4990 489.8152 547.0360 561.9309 628.8542 632.8773 658.5721 684.0820 708.5953 756.8920 788.9771 801.1816 811.0895 834.6083 866.0255 869.2144 876.7590 905.9482 912.1411 931.8199 961.5495 978.9935 983.4376 1017.4037 1023.5635 1035.0227 1044.7764 1066.2100 1072.6492 1092.1192 1095.9534 1098.6374 1104.6536 1107.6552 1112.3200 1118.8863 1171.9240 1177.8988 1196.0359 1208.1672 1218.9382 1250.6961 1255.6539 1267.2336 1284.4352 1290.3423 1297.9720 1303.0473 1317.5189 1323.6867 1325.5789 1336.1093 1341.5888 1351.3244 1354.4950 1360.9875 1363.8324 1365.5269 1377.7191 1444.7680 1455.6596 1456.5334 1458.5724 1460.4031 1468.9008 1472.8979 1485.2144 1505.7933 1625.9188 2953.8484 2957.3844 2961.8045 2966.2086 2966.8205 2985.1050 2993.1217 2998.4012 3004.4989 3011.2746 3011.4320 3016.2126 3018.4772 3020.8011 3026.5507 3026.6626 3030.9510 3057.3076 3102.4649 3549.7915 3560.9253
redmass: 5.3962 3.8448 5.8161 6.0792 4.8756 3.2057 5.7307 4.3505 3.3886 2.9822 1.9897 1.5480 2.2028 2.2448 2.1390 1.8696 1.8847 3.4792 2.8884 2.7416 1.6209 2.5596 3.5787 3.8804 3.7062 4.0266 9.6111 4.1087 2.8793 2.6287 2.7972 3.4139 1.5816 1.5603 2.5489 2.1307 2.1055 2.1438 2.1549 2.1321 3.1083 4.8067 3.1096 1.8135 1.8091 1.5993 2.0308 1.7715 1.9531 1.4370 2.5413 1.0314 1.0174 1.0281 1.8116 1.2309 1.4277 1.1034 1.3870 1.5783 1.3363 1.7115 1.8237 1.9330 2.0614 2.1607 1.4202 1.3321 1.3180 1.4058 1.4315 1.4340 1.3807 1.4067 1.5312 1.4604 1.3642 1.1521 1.1476 1.0916 1.2493 1.1045 1.0901 1.2110 1.1207 2.1294 4.9733 1.0629 1.0626 1.0615 1.0622 1.0605 1.0636 1.0842 1.0841 1.0864 1.0885 1.0985 1.0961 1.1030 1.0573 1.1017 1.0947 1.0942 1.0970 1.1116 1.0767 1.0769
irintensity: 0.0202 0.9608 1.3834 11.4368 11.7365 10.6744 1.5847 1.5484 6.2804 7.5390 0.1523 7.1788 9.9566 6.9780 8.8392 0.1382 0.0357 0.7873 2.8984 4.1942 154.9012 72.9250 0.0664 1.4290 2.2993 0.0372 6.1338 0.4358 0.9912 1.1018 6.8548 28.5702 0.5887 0.0335 14.4909 2.9936 0.0922 9.1858 16.0677 9.7218 22.7816 8.4274 21.9715 1.1059 0.3800 1.3545 4.1555 1.9105 2.6328 3.1325 35.6280 0.1697 1.4251 0.0526 3.8618 0.6236 4.9192 42.1013 47.5997 1.3210 138.7069 78.3468 1.9447 4.3109 0.3107 13.3502 1.2061 3.0828 1.3251 38.9193 1.8276 2.4272 8.6938 4.5290 4.2352 10.5199 0.6946 44.0962 26.3493 2.6618 37.9128 0.6833 19.9218 1.9865 53.7688 645.1105 172.4476 40.4361 32.7615 34.6595 19.8050 34.0312 61.9255 150.4811 140.1914 75.1315 14.7592 29.4989 40.7919 10.8186 42.5401 77.0603 41.8554 45.2508 12.7189 44.6182 15.0705 17.6547
temp: 298.150 k
press: 1.00000 atm
elementType: 9 8 7 7 6 6 6 6 6 6 6 6 6 6 6 6 6 1 1 1 1 1 1 1 1 1 1 1 1 1 1 1 1 1 1 1 1 1
symmnumber: 1
zpe: 865510.3 jmol-1
zpe.correction: 0.329655 hartree
zpe.thermalcorrener: 0.343365 hartree
zpe.thermalcorrenthalpy: 0.344309 hartree
zpe.thermalcorrgfe: 0.289236 hartree
zpe.sumelectzpe: -791.258090 hartree
zpe.sumelectthermal: -791.244381 hartree
zpe.sumelectthermalent: -791.243437 hartree
zpe.sumelectthermalfe: -791.298509 hartree
dipole: -1.3728 1.7318 -0.4179
dipole: 2.2491
quadrupole: -98.8595 -109.0891 -100.7115
quadrupole: -4.9103 -0.0551 -0.2076
quadrupole: 4.0272 -6.2024 2.1752 -4.9103 -0.0551 -0.2076
hfenergy: -791.5877455 hartree
pointgroup: C01 [X(C13H21F1N2O1)]
dipole: 0.5639144 -0.5234735 -0.4369731 debye
polarizability: 186.1210431|-1.3442577|131.7033606|3.2976389|6.4970777|128.0066004 unknown
InChI: InChI=1S/C13H21FN2O/c14-1-2-15-13(17)16-12-10-4-8-3-9(6-10)7-11(12)5-8/h8-12,15-16H,1-7H2
charge 0 multiplicity 1
38 atoms
F  -5.517861 -1.493158 -0.755151
O  -1.993013 1.519634 0.923398
N  -0.717279 -0.088489 -0.212476
N  -3.043926 0.038471 -0.551072
C  1.370325 -0.803706 1.005103
C  1.471293 1.071934 -0.705361
C  3.508966 0.542172 0.716541
C  2.773506 -1.076782 -1.097892
C  0.568256 0.360054 0.35056
C  2.600492 -0.197482 1.737242
C  1.864246 -1.8095 -0.072229
C  2.698436 1.675501 0.031094
C  1.961697 0.060381 -1.777907
C  3.996938 -0.466561 -0.359076
C  -1.914781 0.548236 0.103554
C  -4.370752 0.603521 -0.311749
C  -5.344751 -0.425011 0.250938
H  0.714507 -1.319848 1.732865
H  0.882993 1.879437 -1.182187
H  4.381751 0.975299 1.243808
H  3.123146 -1.79529 -1.865625
H  0.294148 1.093996 1.131119
H  3.171847 -1.004516 2.23842
H  2.262878 0.503682 2.526277
H  1.008258 -2.28843 -0.593207
H  2.426512 -2.629476 0.417577
H  2.360999 2.412931 0.786527
H  3.340669 2.219211 -0.690501
H  2.593673 0.585633 -2.52141
H  1.103236 -0.363487 -2.339458
H  4.660625 0.044615 -1.085475
H  4.592729 -1.271671 0.116506
H  -0.708256 -0.842805 -0.899842
H  -2.978896 -0.76817 -1.172989
H  -4.23678 1.428966 0.412357
H  -4.792118 1.027851 -1.244629
H  -6.346431 0.007384 0.425371
H  -4.953382 -0.912426 1.16058
