program: Gaussian 09
title: 000280754
version: EM64L-G09RevD.01
frameworkgroup: C1[X(C9H15NO5)]
method: RPBEPBE
basis: SDD
operation: Freq
keyword: #p
keyword: freq=noraman
keyword: PBEPBE/SDD
title: #p freq=noraman PBEPBE/SDD
converged: YES YES NO NO
title: Mulliken charges:
elementType: O O O O O N C C C C C C C C C H H H H H H H H H H H H H H H
charge: -0.302071 -0.265250 -0.279345 -0.250339 -0.229425 -0.394493 -0.546065 -0.491594 0.272860 -0.418395 0.251413 0.245436 -0.255093 -0.658044 -0.505100 0.223902 0.274657 0.251646 0.291270 0.272176 0.276297 0.349192 0.226001 0.241323 0.223542 0.226896 0.251461 0.242374 0.240230 0.234539
chargesum: 0.00000
title: Mulliken charges with hydrogens summed into heavy atoms:
elementType: O O O O O N C C C C C C C C C
charge: -0.302071 -0.265250 -0.279345 -0.250339 -0.229425 -0.045302 -0.047507 0.051321 0.272860 0.130077 0.251413 0.245436 0.212231 0.043855 0.212044
polarizability: 1.63791433e+02 7.26800847e-01 1.14427812e+02 2.82737710e+00 5.39335849e+00 8.87402927e+01
1716.lowfreq: -11.1043 -4.5745 -0.0006 -0.0004 -0.0001 1.4063 14.0508 24.7721 32.0650
frequency: 12.9017 24.6163 31.9229 40.9359 51.2312 66.6023 80.5964 99.6841 109.2160 132.4282 166.8672 182.4404 202.1875 205.9416 246.0709 265.8031 305.6567 330.3244 400.1966 432.7942 512.2826 539.5194 563.8569 579.3483 605.2834 625.2122 646.0353 709.5195 755.8182 801.8103 816.1603 848.2059 889.0891 951.2453 955.7945 978.5623 1015.7888 1017.6174 1069.3719 1097.6916 1111.7397 1116.2370 1139.6044 1148.6123 1155.7942 1163.5124 1190.7098 1209.8113 1227.5993 1248.7107 1278.3473 1303.6570 1334.1640 1356.9245 1363.9654 1392.6760 1421.7225 1443.9458 1452.9038 1454.7858 1457.7419 1461.7646 1463.8661 1464.0633 1480.2198 1483.8831 1609.8969 1642.0566 1657.1622 2988.2427 2991.8172 2995.1333 2995.4094 3004.2314 3030.0285 3034.7721 3044.3691 3075.2535 3090.3431 3096.9284 3105.6934 3123.1056 3149.4592 3549.4330
redmass: 4.1019 4.7078 3.9382 4.5555 4.2260 3.5159 3.5811 1.0748 3.8399 3.1357 3.8260 2.6030 1.4871 4.0482 3.0052 4.5854 2.9569 5.3644 3.4712 4.3098 3.9529 2.4867 2.7594 4.2615 1.7786 2.0867 4.8416 3.6089 2.4146 1.8445 1.5002 5.1225 3.2395 4.7299 6.3503 2.0323 2.9280 2.1895 4.5188 2.1835 1.2835 2.7528 2.6813 1.4499 1.6561 1.5547 3.7440 1.0863 1.7506 1.2283 1.1194 1.3135 1.5952 1.2843 1.8389 1.2301 1.1981 1.0714 1.0507 1.0989 1.0845 1.1020 1.0489 1.0510 2.2342 1.0537 7.1681 8.7703 9.9283 1.0621 1.0602 1.0367 1.0618 1.0299 1.0995 1.0596 1.0988 1.0962 1.0974 1.1032 1.1046 1.1067 1.1047 1.0782
irintensity: 0.6234 0.7517 2.7620 0.3685 5.2946 2.1033 0.0671 0.2603 3.5121 5.3122 7.4765 2.1584 2.5447 12.4161 1.3764 41.4484 7.3967 13.9145 3.3857 10.7127 19.5028 5.1060 6.1631 16.8679 60.7394 28.5001 6.6349 1.6410 19.1584 19.5254 1.9910 7.0154 34.0755 19.7953 13.5053 2.5379 102.2568 3.0995 44.4999 22.8031 0.4195 9.3534 209.9818 14.0729 23.3746 92.3250 259.6523 1.6044 52.8335 93.3896 4.1358 16.0413 44.6584 0.5972 27.3721 25.5201 25.2930 5.0964 16.0623 41.5878 22.2537 20.0065 13.9947 17.6066 439.0749 7.6008 182.2992 146.6575 183.6574 5.6062 32.6913 17.5140 33.9659 27.9301 4.6033 27.0917 11.0801 11.2896 32.3042 1.5130 27.8516 26.3915 16.9323 75.7084
temp: 298.150 k
press: 1.00000 atm
elementType: 8 8 8 8 8 7 6 6 6 6 6 6 6 6 6 1 1 1 1 1 1 1 1 1 1 1 1 1 1 1
symmnumber: 1
zpe: 627303.3 jmol-1
zpe.correction: 0.238927 hartree
zpe.thermalcorrener: 0.256722 hartree
zpe.thermalcorrenthalpy: 0.257666 hartree
zpe.thermalcorrgfe: 0.188496 hartree
zpe.sumelectzpe: -781.664776 hartree
zpe.sumelectthermal: -781.646981 hartree
zpe.sumelectthermalent: -781.646037 hartree
zpe.sumelectthermalfe: -781.715207 hartree
dipole: -0.8764 -4.5875 0.9300
dipole: 4.7622
quadrupole: -73.7693 -94.2058 -90.9343
quadrupole: 10.3312 4.8640 -2.9427
quadrupole: 12.5338 -7.9027 -4.6311 10.3312 4.8640 -2.9427
hfenergy: -781.9037034 hartree
pointgroup: C01 [X(C9H15N1O5)]
dipole: -0.0546255 -1.6447575 0.8956256 debye
polarizability: 162.4322474|8.1573324|116.6263706|-1.871171|-3.0671402|87.900919 unknown
InChI: InChI=1S/C9H15NO5/c1-3-15-9(13)6-10-7(11)4-5-8(12)14-2/h10H,3-6H2,1-2H3
charge 0 multiplicity 1
30 atoms
O  -3.029176 -1.321291 -0.003124
O  5.156709 0.6290 0.345732
O  0.347128 2.096882 -0.664884
O  4.217227 -0.756714 -1.272249
O  -4.571685 0.409605 -0.296896
N  -0.902865 0.189463 -0.269123
C  1.548146 -0.040461 -0.374238
C  2.783594 0.772745 0.049292
C  0.298764 0.846452 -0.438606
C  -2.1721 0.909529 -0.380638
C  4.079772 0.113314 -0.380126
C  -3.390089 0.010585 -0.22681
C  -4.149246 -2.302242 0.180047
C  -4.592598 -2.346514 1.643693
C  6.494284 0.111848 -0.034203
H  1.387203 -0.902533 0.29969
H  1.734071 -0.459803 -1.382737
H  2.810702 0.959383 1.136469
H  2.718727 1.77172 -0.427757
H  -2.240184 1.712166 0.379747
H  -2.246423 1.42725 -1.356761
H  -0.9471 -0.815536 -0.08842
H  -3.713147 -3.256458 -0.15532
H  -4.977751 -2.004486 -0.485695
H  -5.360851 -3.131136 1.772931
H  -3.744434 -2.583216 2.308865
H  -5.03261 -1.383104 1.950489
H  6.705324 0.339908 -1.092528
H  6.539398 -0.98001 0.11562
H  7.195507 0.633755 0.631643
