program: Gaussian 09
title: 000280771
version: EM64L-G09RevD.01
frameworkgroup: C1[X(C15H18N4O4)]
method: RPBEPBE
basis: SDD
operation: Freq
keyword: #p
keyword: freq=noraman
keyword: PBEPBE/SDD
title: #p freq=noraman PBEPBE/SDD
converged: YES YES NO NO
title: Mulliken charges:
elementType: O O O O N N N N C C C C C C C C C C C C C C C H H H H H H H H H H H H H H H H H H
charge: -0.413448 -0.236177 -0.420703 -0.277508 -0.358623 -0.632834 -0.438375 -0.161574 -0.356838 -0.402586 -0.395128 -0.149508 0.213884 0.151161 -0.006490 0.124298 0.360619 0.088835 -0.371487 -0.368336 -0.248610 -0.246919 -0.246496 0.209337 0.231504 0.215967 0.224768 0.221293 0.246444 0.262193 0.301633 0.278112 0.317444 0.325300 0.276631 0.263519 0.220612 0.218437 0.381707 0.223132 0.374810
chargesum: 0.00000
title: Mulliken charges with hydrogens summed into heavy atoms:
elementType: O O O O N N N N C C C C C C C C C C C C C C C
charge: -0.031742 -0.236177 -0.045894 -0.277508 -0.056990 -0.037278 -0.113075 -0.161574 0.084003 0.038149 0.072609 0.112685 0.213884 0.151161 -0.006490 0.124298 0.360619 0.088835 -0.094855 -0.104817 -0.027998 -0.028481 -0.023364
polarizability: 3.18763175e+02 3.75142635e+01 1.87613697e+02 -4.01018276e+01 2.40734623e+01 1.51594670e+02
1716.lowfreq: -10.6043 -6.1043 -0.0006 0.0005 0.0006 2.2477 11.0587 19.8725 25.1643
frequency: 10.8774 19.0772 24.3906 40.6495 42.0272 45.4618 57.3169 98.5610 106.4418 133.8570 164.2072 175.8742 202.4806 208.6482 216.0655 219.3498 259.3133 286.3781 288.5524 306.0432 334.4992 362.3515 372.2847 385.9687 403.0809 412.1195 444.5477 481.3450 502.9525 515.3974 527.8140 544.1375 547.7866 574.5988 603.6195 616.9953 625.6683 634.0639 666.0420 678.2869 695.7668 702.0794 710.4180 718.6226 746.0678 751.8398 781.8981 798.4230 845.4722 849.1223 917.5136 920.7726 953.3518 961.4223 973.9293 990.0935 991.2974 1020.4788 1035.0748 1043.6189 1047.3915 1055.1439 1067.0639 1091.0665 1099.6209 1139.2754 1157.6950 1172.6051 1175.5897 1193.5872 1207.2644 1223.5184 1229.3513 1259.6608 1272.5786 1286.6930 1294.3494 1299.7845 1304.1218 1320.6203 1357.1371 1360.0118 1368.1994 1375.0247 1388.0953 1422.8995 1437.5235 1455.6185 1460.4469 1477.1014 1488.4032 1540.0185 1576.2245 1580.9439 1599.1945 1602.6470 1612.8458 1624.2448 1668.5120 2970.4629 2978.7792 2986.4190 3002.6597 3030.1839 3052.3939 3082.4984 3119.5746 3132.1605 3153.1594 3186.0955 3189.4165 3508.1727 3515.2936 3515.8450 3516.5398 3571.9580 3660.7689
redmass: 6.4571 5.8186 5.1511 5.8947 6.4881 6.3163 4.7706 2.8069 5.3198 3.4586 4.9712 4.9228 6.4641 2.5363 2.1148 2.1763 3.3400 4.1306 5.1729 3.5053 2.2570 4.1357 1.4425 2.6745 2.7564 2.1517 3.0825 4.1990 2.4792 3.0809 4.6711 1.9053 3.9715 2.3987 5.4318 6.1130 2.5034 1.7568 3.7970 6.5274 1.7282 2.3124 3.4320 4.5072 2.5317 1.4829 2.6724 3.1781 1.2536 1.6651 2.1989 1.6220 8.0025 4.3396 1.4151 2.7647 1.7413 2.8304 2.4680 3.6177 3.0452 2.0173 2.4475 1.6918 3.0083 1.5214 3.6670 1.0866 1.5563 1.9769 1.1512 1.9083 1.3955 1.5045 1.5745 1.3321 1.7436 1.3656 1.6454 1.7756 1.3176 2.2594 1.4069 7.4875 1.8840 2.2564 2.4579 1.0946 1.0918 1.1006 2.2223 2.7250 4.7130 5.3265 2.8814 1.5947 5.3605 7.6311 4.3084 1.0673 1.0654 1.0728 1.0649 1.0974 1.0999 1.1022 1.0848 1.0906 1.0979 1.0930 1.0952 1.0774 1.0509 1.0636 1.0580 1.0775 1.1012
irintensity: 0.4855 0.3559 0.1642 1.1588 1.0504 0.4359 0.5606 3.0895 1.6613 3.2626 0.1564 3.6258 5.8547 18.9707 19.7887 13.5616 16.9846 4.7070 6.7573 6.1848 23.0892 4.1970 302.7745 28.3823 7.1375 97.2953 36.4496 20.9655 10.1461 10.6148 12.7778 55.9932 23.2475 66.9030 22.4981 0.4448 81.5128 139.6323 15.5328 36.3718 64.9186 26.0855 18.0344 26.8375 10.6211 9.3385 71.8281 2.4421 1.0432 2.3850 6.8720 4.3973 32.6578 16.1133 1.2069 0.3367 0.5552 46.8945 0.9590 56.0809 182.6874 86.8378 49.7166 11.6889 43.6804 8.4769 70.5230 0.8347 4.2369 9.8167 8.8416 90.1942 8.8892 17.0102 21.7195 42.0980 30.7718 19.2888 82.9101 36.5799 0.9214 42.2033 19.6408 8.3232 5.9856 97.7171 21.9571 21.3190 5.9590 15.9711 25.8413 17.3934 31.7163 14.0352 615.3109 653.6055 174.3666 336.5150 143.2486 9.1897 17.8537 53.4251 60.3422 3.5580 41.2418 19.4104 0.3515 27.4574 48.6522 6.2198 7.0309 33.0229 20.3061 41.5588 22.8757 72.8772 16.0873
temp: 298.150 k
press: 1.00000 atm
elementType: 8 8 8 8 7 7 7 7 6 6 6 6 6 6 6 6 6 6 6 6 6 6 6 1 1 1 1 1 1 1 1 1 1 1 1 1 1 1 1 1 1
symmnumber: 1
zpe: 843432.2 jmol-1
zpe.correction: 0.321246 hartree
zpe.thermalcorrener: 0.343774 hartree
zpe.thermalcorrenthalpy: 0.344718 hartree
zpe.thermalcorrgfe: 0.265588 hartree
zpe.sumelectzpe: -1100.632045 hartree
zpe.sumelectthermal: -1100.609518 hartree
zpe.sumelectthermalent: -1100.608574 hartree
zpe.sumelectthermalfe: -1100.687704 hartree
dipole: 6.8722 1.3572 -3.2344
dipole: 7.7156
quadrupole: -143.8363 -126.8928 -138.9221
quadrupole: 21.6407 -9.0515 3.6364
quadrupole: -7.2859 9.6576 -2.3717 21.6407 -9.0515 3.6364
hfenergy: -1100.9532918 hartree
pointgroup: C01 [X(C15H18N4O4)]
dipole: 2.7134535 -0.0502172 -1.3598412 debye
polarizability: 320.3700542|16.6980297|198.457142|-49.8417532|5.9335631|139.1443464 unknown
InChI: InChI=1S/C15H18N4O4/c16-10(14(22)23)7-4-8-17-15-18-12(20)11(13(21)19-15)9-5-2-1-3-6-9/h1-3,5-6,10,17-18,21-22H,4,7-8,16H2
charge 0 multiplicity 1
41 atoms
O  7.208194 0.225607 0.271591
O  5.922935 0.575246 2.17361
O  -1.517887 -1.985756 -0.179307
O  -2.726992 2.742899 -0.195452
N  1.557485 1.29393 -1.395428
N  4.661791 -1.865512 1.825443
N  -0.640876 1.94085 -0.772497
N  -0.027425 -0.33693 -0.764086
C  3.503158 0.081384 -0.339203
C  4.581961 -0.993526 -0.584462
C  2.628088 0.299894 -1.595073
C  5.426152 -1.351484 0.6954
C  0.295521 0.946975 -0.970529
C  6.179656 -0.108896 1.158757
C  -2.355032 0.302548 -0.126399
C  -2.001453 1.710439 -0.335254
C  -3.728437 -0.071897 0.309776
C  -1.317396 -0.621437 -0.364438
C  -4.531389 0.841949 1.055454
C  -4.292603 -1.343091 -0.008063
C  -5.832737 0.491876 1.472552
C  -5.596885 -1.684585 0.405477
C  -6.377397 -0.772188 1.151704
H  3.977044 1.039354 -0.044846
H  2.852769 -0.229084 0.500229
H  4.09969 -1.932516 -0.924198
H  5.276726 -0.676403 -1.386808
H  3.252503 0.633652 -2.445861
H  2.142843 -0.648554 -1.881903
H  6.190561 -2.08658 0.37205
H  1.796199 2.282828 -1.467911
H  3.990704 -2.607002 1.633467
H  4.399022 -1.184518 2.539267
H  -0.431831 2.931078 -0.933842
H  -4.137332 1.833101 1.288516
H  -3.70534 -2.067435 -0.575741
H  -6.424038 1.214398 2.046913
H  -6.00403 -2.667733 0.1419
H  7.668292 1.047015 0.595255
H  -7.390213 -1.040009 1.473769
H  -0.643902 -2.427286 -0.355131
