program: Gaussian 09
title: 000280729
version: EM64L-G09RevD.01
frameworkgroup: C1[X(C10H6ClNO)]
method: RPBEPBE
basis: SDD
operation: Freq
keyword: #p
keyword: freq=noraman
keyword: PBEPBE/SDD
title: #p freq=noraman PBEPBE/SDD
converged: YES YES NO YES
title: Mulliken charges:
elementType: Cl O N C C C C C C C C C C H H H H H H
charge: 0.001036 -0.193330 0.014236 0.340169 0.055651 0.258666 -0.400893 -0.225796 -0.269582 -0.238788 -0.238570 -0.359297 -0.185460 0.230612 0.273563 0.239825 0.263665 0.253354 0.180939
chargesum: 0.00000
title: Mulliken charges with hydrogens summed into heavy atoms:
elementType: Cl O N C C C C C C C C C C
charge: 0.001036 -0.193330 0.014236 0.340169 0.055651 0.258666 -0.170281 -0.225796 0.003982 0.001037 0.025095 -0.105943 -0.004521
polarizability: 1.88342561e+02 -7.74408592e+00 1.52271343e+02 -1.55702686e-03 -1.59982714e-03 4.75102666e+01
1716.lowfreq: -12.1766 -0.0018 -0.0016 -0.0014 1.6998 3.1606 58.0442 106.6582 168.2315
frequency: 58.0429 106.6579 168.2311 168.7705 181.3576 230.9397 247.1928 333.6632 384.9199 465.5134 466.8440 475.4004 517.9828 546.6772 571.8431 641.9113 699.4158 766.0501 787.7961 814.1905 828.2528 835.1811 873.9346 901.8926 967.1889 981.9963 995.7691 1026.1986 1060.8171 1092.0439 1176.0433 1205.2519 1224.6067 1238.0243 1320.1699 1345.3123 1374.5678 1400.7814 1416.0560 1439.2345 1501.0689 1538.5395 1561.5356 1607.5958 1612.1937 2935.3483 3137.2052 3145.6410 3164.9326 3165.7401 3178.8442
redmass: 10.8976 2.9964 4.5751 12.2009 4.1830 7.8818 3.8860 11.1290 8.0871 3.1970 4.4917 6.5758 6.9728 8.4523 4.4142 3.7627 7.6530 1.4598 5.9301 6.2292 3.7860 5.4525 1.2677 1.4068 1.6844 1.3575 1.5910 3.8595 2.4812 2.2732 1.3249 1.7201 1.9572 2.8187 5.2093 3.1401 1.7619 1.4568 3.3546 2.4150 3.6954 7.1581 7.8663 6.7247 6.8823 1.0851 1.0896 1.0865 1.0957 1.0930 1.0983
irintensity: 1.9606 8.3643 0.8103 1.0766 9.6460 5.7515 4.8304 1.6563 9.6773 0.3980 0.8618 13.5418 0.2307 3.0633 0.0091 1.0987 64.8715 53.2721 5.1897 2.3307 20.1041 1.3676 33.4569 0.1341 2.7480 1.1211 3.0126 69.9868 12.2326 31.9250 0.9041 10.5777 2.8679 63.5141 12.0328 6.7328 11.4291 12.2356 13.3925 29.1575 18.1632 22.3298 140.1590 17.7768 80.3142 72.5410 14.6608 1.9834 6.3955 11.2321 8.8507
temp: 298.150 k
press: 1.00000 atm
elementType: 17 8 7 6 6 6 6 6 6 6 6 6 6 1 1 1 1 1 1
symmnumber: 1
zpe: 346231.4 jmol-1
zpe.correction: 0.131873 hartree
zpe.thermalcorrener: 0.142178 hartree
zpe.thermalcorrenthalpy: 0.143122 hartree
zpe.thermalcorrgfe: 0.095185 hartree
zpe.sumelectzpe: -973.795763 hartree
zpe.sumelectthermal: -973.785457 hartree
zpe.sumelectthermalent: -973.784513 hartree
zpe.sumelectthermalfe: -973.832450 hartree
dipole: -0.4064 2.7943 -0.0012
dipole: 2.8237
quadrupole: -97.0601 -69.1096 -83.4882
quadrupole: -6.1942 -0.0052 0.0001
quadrupole: -13.8408 14.1097 -0.2690 -6.1942 -0.0052 0.0001
hfenergy: -973.9276353 hartree
pointgroup: C01 [X(C10H6Cl1N1O1)]
dipole: -0.2845914 -1.0737556 -0.0160402 debye
dipolederiv: -0.5647234 0.3125829 0.0222234 0.4180427 -0.3096033 -0.0181846 0.0246585 -0.0151949 -0.0374302 -1.2091258 0.1839474 0.0296705 -0.071572 -0.3630049 0.0010193 0.0239942 -0.0062949 -0.3155268 -0.1654504 -0.0292884 -0.0021685 0.1935844 -0.237795 -0.0059073 0.0030035 0.0003701 -0.2188279 -0.0988551 -0.1022486 0.0025794 0.3774445 0.040438 -0.011388 0.0134305 0.0022158 0.0735666 0.0167455 0.3421632 0.0094864 0.0166651 -0.1318144 -0.0052799 0.0020263 -0.0144792 0.0748369 -0.3317562 0.254372 0.0153753 0.5571191 -0.2396942 -0.0212822 0.0221587 -0.0126181 0.0045313 -0.1432097 -0.0632466 -0.0022465 -0.1914217 -0.0061613 0.0092021 -0.005205 0.0055441 -0.1715295 0.9011761 -0.4810481 -0.0386389 -0.715634 0.5186051 0.0338903 -0.0440772 0.0272493 -0.0659771 0.0664356 0.1538471 0.0005319 -0.2642749 -0.2335003 0.0030216 -0.0089202 -0.0088691 -0.0383639 0.10402 -0.1042478 -0.0090188 -0.0414221 0.2131889 0.0090993 -0.0076007 0.0109233 -0.130356 -0.039586 0.1137014 0.0006972 0.1940094 -0.3350613 -0.0107673 0.0025888 -0.008525 -0.1081201 -0.1577848 -0.1287925 -0.0000007 0.0435501 0.4860672 0.0110791 0.0038628 0.0159651 -0.0545166 1.4621688 -0.2888095 -0.0450984 -0.438758 0.7797607 0.0272182 -0.0484734 0.0230512 0.1137744 0.0015041 0.1172969 0.007185 0.0572731 0.0086418 -0.0051128 0.0058453 -0.0068254 0.1605314 0.0169116 -0.0638561 0.002277 -0.0227314 0.1090678 -0.0002679 0.0032282 0.0009172 0.1492867 0.0668598 -0.0366605 0.0018072 -0.0379825 -0.0908394 -0.0047092 0.0017546 -0.004732 0.1604081 -0.0336065 -0.0350446 0.00488 -0.0290513 0.0948245 -0.0008375 0.0050571 -0.0006705 0.1668112 0.0599645 -0.0393592 0.0010783 -0.0498836 -0.0947848 -0.0036978 0.000825 -0.0040021 0.1296629 0.048312 -0.105309 -0.0006199 0.0050431 -0.2083352 -0.0070956 0.0018431 -0.0040248 0.1072388 unknown
polarizability: 189.5173583|3.5276133|150.9329138|-3.9449961|2.2650693|47.6738983 unknown
InChI: InChI=1S/C10H6ClNO/c11-9-3-1-2-8-7(6-13)4-5-12-10(8)9/h1-6H
charge 0 multiplicity 1
19 atoms
Cl -3.509165 1.287575 0.093168
O  3.980488 -0.494695 -0.160505
N  -0.550957 1.880967 0.022279
C  0.246202 -0.484769 -0.054045
C  -0.808419 0.522532 -0.001332
C  1.608567 0.004382 -0.081417
C  -0.11176 -1.871945 -0.075743
C  -2.173508 0.070853 0.027063
C  1.839381 1.389225 -0.056428
C  -1.453861 -2.255821 -0.046741
C  -2.498005 -1.283724 0.005108
C  0.735093 2.285911 -0.004836
C  2.789815 -0.906849 -0.135507
H  0.659572 -2.645903 -0.115256
H  2.87001 1.75734 -0.077262
H  -1.72069 -3.317537 -0.063638
H  -3.545357 -1.59732 0.027596
H  0.898231 3.369186 0.015187
H  2.583062 -2.000709 -0.153792
