program: Gaussian 09
title: 000280722
version: EM64L-G09RevD.01
frameworkgroup: C1[X(C9H16S4)]
method: RPBEPBE
basis: SDD
operation: Freq
keyword: #pfreq=noraman
keyword: PBEPBE/SDD
title: #p freq=noraman PBEPBE/SDD
converged: YES YES NO NO
title: Mulliken charges:
elementType: S S S S C C C C C C C C C H H H H H H H H H H H H H H H H
charge: 0.219953 0.228971 0.219952 0.228970 -0.221952 -0.774872 -0.774872 -0.291974 -0.291974 -0.660565 -0.657991 -0.660566 -0.657989 0.245772 0.245771 0.331469 0.331469 0.243909 0.209173 0.243909 0.209172 0.247148 0.263716 0.259692 0.246575 0.247148 0.263716 0.259693 0.246574
chargesum: 0.00000
title: Mulliken charges with hydrogens summed into heavy atoms:
elementType: S S S S C C C C C C C C C
charge: 0.219953 0.228971 0.219952 0.228970 0.269592 -0.443403 -0.443402 0.161108 0.161108 -0.149702 -0.151724 -0.149702 -0.151722
polarizability: 1.87357101e+02 -1.53307180e+01 1.47689559e+02 -5.85950474e-04 9.33899733e-05 1.42192673e+02
1716.lowfreq: -13.4610 -10.1812 -0.0021 0.0029 0.0031 12.5820 35.1783 46.2751 64.4547
frequency: 35.1547 46.2112 64.4544 97.3888 113.7737 155.5153 157.5175 187.6927 261.2015 279.6085 291.3539 302.1626 305.4783 316.9038 345.5523 402.8208 437.5118 453.7816 483.8023 569.1141 588.9904 607.0282 615.2805 618.2804 638.0272 653.3650 753.9559 807.3826 807.6090 865.0944 871.6954 911.1679 913.4553 950.7676 997.4115 1003.8142 1018.9859 1069.9517 1070.5250 1075.6486 1114.3904 1114.7516 1146.8268 1169.4523 1169.7597 1202.2050 1214.4528 1238.6458 1239.0153 1246.3631 1280.5768 1280.7626 1288.8955 1296.6380 1302.6690 1318.2045 1347.3003 1347.4114 1428.5800 1430.9412 1438.0623 1438.1167 1444.8149 1447.7722 1460.5355 2963.6524 2963.7921 2982.9018 3012.2152 3012.6626 3014.5568 3014.7678 3035.1685 3051.2334 3051.2362 3053.6377 3057.9627 3085.0081 3085.0137 3091.1272 3091.1814
redmass: 7.2252 4.3611 3.9165 4.2713 3.5884 2.7336 3.7288 6.7900 3.8687 3.2066 4.6993 2.1552 4.6879 2.9693 9.8210 4.6550 2.2319 2.2562 3.1971 3.4236 3.8575 4.4581 5.2071 5.3261 5.8731 7.2693 5.3313 1.4035 1.4067 2.3739 2.6936 1.8976 1.8927 1.7523 1.9999 1.7918 4.0415 2.0593 1.9656 3.6534 1.1396 1.1330 1.1116 1.1416 1.1505 1.1383 1.1373 1.2413 1.2389 1.2026 1.2878 1.2838 1.1343 1.1716 1.1463 1.3242 1.4365 1.4368 1.0842 1.0841 1.0836 1.0835 1.0926 1.0932 1.0811 1.0649 1.0648 1.0599 1.0612 1.0605 1.0612 1.0614 1.0974 1.0932 1.0933 1.0850 1.0895 1.1047 1.1047 1.1046 1.1047
irintensity: 0.9191 1.4532 0.2784 0.1444 2.7740 3.0084 0.1387 1.3767 0.0090 0.4842 0.5781 0.9397 2.6454 8.6610 0.3083 0.3231 0.4391 1.2187 13.2479 0.6527 4.5604 8.1705 2.7253 5.9189 4.5983 20.3307 16.9117 2.8082 3.1412 9.1650 1.3531 43.8265 12.2394 22.4425 3.1867 5.2948 3.2525 1.5435 0.3398 4.6639 0.0845 0.1621 12.9024 2.3075 0.8352 16.7106 0.9217 7.7892 4.8093 18.3786 2.5527 8.2073 1.0497 1.0109 0.0002 4.9967 1.1574 0.7870 8.6951 11.3638 30.1207 1.0480 7.4849 11.5526 19.7551 78.1086 3.9423 5.9574 0.5490 41.3418 46.6375 11.5162 19.8058 17.0365 18.3639 0.8855 3.1256 5.8570 7.7058 11.6906 45.6474
temp: 298.150 k
press: 1.00000 atm
elementType: 16 16 16 16 6 6 6 6 6 6 6 6 6 1 1 1 1 1 1 1 1 1 1 1 1 1 1 1 1
symmnumber: 1
zpe: 616786.8 jmol-1
zpe.correction: 0.234922 hartree
zpe.thermalcorrener: 0.249677 hartree
zpe.thermalcorrenthalpy: 0.250621 hartree
zpe.thermalcorrgfe: 0.192075 hartree
zpe.sumelectzpe: -1943.754507 hartree
zpe.sumelectthermal: -1943.739752 hartree
zpe.sumelectthermalent: -1943.738808 hartree
zpe.sumelectthermalfe: -1943.797354 hartree
dipole: 0.0000 0.0002 -3.3327
dipole: 3.3327
quadrupole: -96.7550 -112.2876 -112.7162
quadrupole: -14.0694 -0.0007 0.0000
quadrupole: 10.4979 -5.0346 -5.4633 -14.0694 -0.0007 0.0000
hfenergy: -1943.9894291 hartree
pointgroup: C01 [X(C9H16S4)]
dipole: 0.0000117 -0.0000702 1.3112033 debye
polarizability: 188.5909093|13.5855248|146.4557506|0.0005894|0.0000683|142.1926734 unknown
InChI: InChI=1S/C9H16S4/c1-3-10-8(11-4-1)7-9-12-5-2-6-13-9/h8-9H,1-7H2
charge 0 multiplicity 1
29 atoms
S  -2.015797 -0.406803 -1.682491
S  -2.198587 1.808394 0.553364
S  2.015805 0.406988 -1.682449
S  2.198575 -1.808437 0.553182
C  0.000001 0.0000 0.330476
C  -1.059043 0.737067 -0.51479
C  1.059041 -0.736992 -0.514862
C  -3.967061 -0.462002 0.440669
C  3.967082 0.461945 0.440705
C  -3.055754 -1.361078 -0.414473
C  -3.206011 0.45287 1.41592
C  3.055785 1.361121 -0.414343
C  3.206021 -0.45301 1.415869
H  0.484168 0.74443 0.991357
H  -0.484162 -0.744492 0.991292
H  -0.567993 1.452682 -1.197338
H  0.567986 -1.452533 -1.197483
H  -4.610769 0.149497 -0.218016
H  -4.63311 -1.120719 1.037808
H  4.610776 -0.1495 -0.218044
H  4.633146 1.120592 1.037906
H  -2.38084 -1.968208 0.215099
H  -3.652607 -2.04736 -1.038929
H  -3.906728 1.019523 2.052361
H  -2.533107 -0.125482 2.073845
H  2.380886 1.9682 0.215294
H  3.652645 2.047453 -1.038735
H  3.906728 -1.019734 2.052256
H  2.533123 0.125289 2.073849
