program: Gaussian 09
title: 000280723
version: EM64L-G09RevD.01
frameworkgroup: C1[X(C11H20S4)]
method: RPBEPBE
basis: SDD
operation: Freq
keyword: #pfreq=noraman
keyword: PBEPBE/SDD
title: #p freq=noraman PBEPBE/SDD
converged: YES YES NO NO
title: Mulliken charges:
elementType: S S S S C C C C C C C C C C C H H H H H H H H H H H H H H H H H H H H
charge: 0.220414 0.209858 0.209859 0.220430 -0.511926 -0.511964 -0.146656 -0.654321 -0.654328 -0.663311 -0.660779 -0.663303 -0.660783 -0.288470 -0.288475 0.245265 0.245258 0.232758 0.237212 0.248255 0.232759 0.237212 0.248256 0.256945 0.246107 0.244141 0.260987 0.256945 0.246106 0.244143 0.260988 0.208417 0.241790 0.208417 0.241792
chargesum: 0.00000
title: Mulliken charges with hydrogens summed into heavy atoms:
elementType: S S S S C C C C C C C C C C C
charge: 0.220414 0.209858 0.209859 0.220430 -0.511926 -0.511964 0.343867 0.063906 0.063897 -0.158179 -0.157727 -0.158174 -0.157731 0.161737 0.161734
polarizability: 1.99547083e+02 -2.51971898e-02 1.74501648e+02 -1.76700108e+01 -2.60846113e-03 1.71614594e+02
1716.lowfreq: -0.0027 -0.0019 -0.0016 5.5361 6.8446 21.4374 25.5058 68.5390 76.2060
frequency: 21.2969 68.3544 76.1698 126.2265 127.0558 171.1452 193.6640 194.2460 209.1700 217.1888 225.4587 237.4378 269.2225 281.6389 294.8136 320.4583 321.1069 323.8846 327.3569 342.9249 357.2347 382.7104 403.1132 471.0256 473.9658 519.9329 563.0249 591.6324 608.1156 608.3549 627.5632 628.0708 685.8583 818.9726 819.1981 839.5060 867.2039 869.6099 878.9184 910.8475 912.8674 934.0897 1004.9986 1007.7129 1038.1265 1045.9547 1073.8119 1077.0251 1086.6848 1116.5870 1123.0196 1125.0905 1159.2785 1179.6412 1180.0291 1189.3430 1242.1299 1242.1407 1280.8359 1282.7427 1291.5769 1297.0341 1306.7516 1328.5977 1347.6702 1347.8002 1390.4140 1397.3840 1432.8812 1434.6618 1434.6940 1440.6987 1445.2475 1446.0603 1453.7967 1457.6277 1458.0401 1460.0987 1465.9247 2963.6335 2963.7788 2995.1434 2995.5115 3002.8885 3009.8901 3010.0056 3016.7041 3017.1972 3051.3192 3051.3825 3053.9667 3082.5787 3082.5992 3089.0183 3089.1101 3094.1294 3094.1954 3100.2513 3102.1506
redmass: 5.1358 4.0282 4.1929 4.1325 3.9925 8.1712 2.7062 3.1599 2.1580 1.2262 1.3289 2.3395 3.6647 3.6212 4.4756 3.4429 1.9798 2.4607 4.5406 7.6542 2.7003 5.3993 2.8006 1.9164 1.9272 5.7009 4.1534 3.7144 4.9045 4.8623 5.8273 6.0323 3.4300 1.3653 1.3662 3.6914 2.5436 2.5558 1.9898 1.9583 1.9289 2.1016 1.7319 1.7279 1.5746 1.5491 2.0616 2.0968 1.8143 1.6936 1.0920 1.2983 3.2959 1.2056 1.2136 4.3321 1.2362 1.2422 1.2576 1.2930 1.2098 1.1722 1.1914 1.2192 1.4389 1.4395 1.1951 1.1836 1.0789 1.0850 1.0852 1.0815 1.0477 1.0438 1.0745 1.0454 1.0895 1.0800 1.0565 1.0647 1.0647 1.0352 1.0355 1.0577 1.0613 1.0613 1.0597 1.0596 1.0938 1.0937 1.0982 1.1042 1.1043 1.1046 1.1047 1.0995 1.0991 1.1006 1.0998
irintensity: 0.4610 2.2331 0.0018 2.7717 0.0336 0.3237 1.5780 1.4748 1.7990 0.3045 0.0761 0.1911 2.9132 1.1434 1.8331 1.8658 1.2720 4.5439 0.0306 0.1311 0.0481 0.4335 0.0976 0.4119 1.4761 18.5147 5.4906 15.3029 4.9553 0.0948 0.3929 0.0088 16.2950 4.1077 3.3845 2.1928 13.5423 0.5216 9.8625 23.8355 17.1523 0.4707 0.2622 1.7840 5.4858 23.2928 6.0038 4.1701 14.0567 57.5033 0.1296 20.1093 2.1434 0.3547 0.1688 23.5552 3.6574 5.9406 11.1728 7.5805 0.0054 1.7634 0.0012 14.3142 1.0847 1.0638 21.7026 28.5992 9.8139 29.1167 1.4028 9.8339 33.8293 0.9421 11.1866 12.0211 11.1348 2.3384 20.9664 69.5464 16.2526 12.5181 10.5999 6.3818 15.6619 33.9592 0.8209 51.8759 16.0636 15.8728 6.8546 6.6577 8.0125 56.3965 2.6034 11.3198 17.9735 40.3058 0.5751
temp: 298.150 k
press: 1.00000 atm
elementType: 16 16 16 16 6 6 6 6 6 6 6 6 6 6 6 1 1 1 1 1 1 1 1 1 1 1 1 1 1 1 1 1 1 1 1
symmnumber: 1
zpe: 760096.4 jmol-1
zpe.correction: 0.289505 hartree
zpe.thermalcorrener: 0.307157 hartree
zpe.thermalcorrenthalpy: 0.308101 hartree
zpe.thermalcorrgfe: 0.244743 hartree
zpe.sumelectzpe: -2022.196684 hartree
zpe.sumelectthermal: -2022.179033 hartree
zpe.sumelectthermalent: -2022.178089 hartree
zpe.sumelectthermalfe: -2022.241446 hartree
dipole: 0.0003 3.0664 -0.0044
dipole: 3.0664
quadrupole: -117.0752 -120.5935 -124.5706
quadrupole: -0.0171 -12.1047 -0.0054
quadrupole: 3.6712 0.1529 -3.8242 -0.0171 -12.1047 -0.0054
hfenergy: -2022.4861898 hartree
pointgroup: C01 [X(C11H20S4)]
dipole: 0.000091 -1.2063965 0.0001469 debye
polarizability: 201.3849299|0.0018577|174.5016503|16.0473231|0.0007434|169.7767451 unknown
InChI: InChI=1S/C11H20S4/c1-10(12-5-3-6-13-10)9-11(2)14-7-4-8-15-11/h3-9H2,1-2H3
charge 0 multiplicity 1
35 atoms
S  -2.39522 1.424859 -0.467549
S  -2.081769 -0.700588 1.816349
S  2.081589 -0.701132 -1.816137
S  2.395275 1.424944 0.467154
C  -1.152319 0.596165 0.726594
C  1.152255 0.595935 -0.726653
C  -0.000017 -0.1562 0.000111
C  0.738246 1.695635 -1.718279
C  -0.738379 1.696142 1.717942
C  3.109455 -0.071777 1.380822
C  2.842893 -1.824134 -0.493129
C  -3.109292 -0.072114 -1.380892
C  -2.842874 -1.823973 0.493553
C  -3.802696 -1.088365 -0.457571
C  3.802796 -1.088246 0.457698
H  0.452079 -0.826214 0.755656
H  -0.45211 -0.826466 -0.755213
H  -0.015812 1.30023 2.452911
H  -0.246828 2.53559 1.198765
H  -1.62677 2.074919 2.25228
H  0.015631 1.299516 -2.453091
H  0.246721 2.535224 -1.199304
H  1.626597 2.074267 -2.252784
H  -3.380247 -2.585586 1.084398
H  -2.031218 -2.329339 -0.059993
H  -2.30833 -0.545293 -1.977514
H  -3.832498 0.381517 -2.080316
H  3.38023 -2.585878 -1.083837
H  2.031325 -2.329395 0.060643
H  2.308556 -0.544821 1.977633
H  3.832714 0.382046 2.080066
H  -4.302364 -1.847049 -1.09707
H  -4.58847 -0.578926 0.129917
H  4.302552 -1.846751 1.097343
H  4.588495 -0.578938 -0.130003
