program: Gaussian 09
title: 000280716
version: EM64L-G09RevD.01
frameworkgroup: C1[X(C11H21NO)]
method: RPBEPBE
basis: SDD
operation: Freq
keyword: #p
keyword: freq=noraman
keyword: PBEPBE/SDD
title: #p freq=noraman PBEPBE/SDD
converged: YES YES NO NO
title: Mulliken charges:
elementType: O N C C C C C C C C C C C H H H H H H H H H H H H H H H H H H H H H
charge: -0.285095 -0.025801 0.030835 0.332649 -0.478041 -0.479430 -0.531852 -0.543523 -0.746242 -0.756160 -0.744753 0.179269 -0.488113 0.172286 0.220011 0.214797 0.215084 0.218692 0.207611 0.233615 0.262795 0.213330 0.216577 0.209345 0.209895 0.220726 0.220141 0.208829 0.209797 0.209119 0.216329 0.220883 0.219537 0.216857
chargesum: 0.00000
title: Mulliken charges with hydrogens summed into heavy atoms:
elementType: O N C C C C C C C C C C C
charge: -0.285095 -0.025801 0.203121 0.332649 -0.043233 -0.045653 -0.090626 -0.067399 -0.110424 -0.106463 -0.109508 0.179269 0.169165
polarizability: 1.74894639e+02 4.49892383e+00 1.16547547e+02 -7.71937805e+00 9.44154610e-02 1.05357763e+02
1716.lowfreq: -21.2361 -10.4968 0.0003 0.0004 0.0009 4.4660 31.4211 38.0374 84.3282
frequency: 30.9155 37.8562 84.3196 113.7528 134.1419 169.5939 177.0273 206.6024 230.2667 238.3862 247.5569 256.6494 303.1615 316.1974 330.8398 370.5060 383.4098 407.8859 432.5000 449.6628 463.7995 508.8335 518.5273 653.8389 754.7426 779.5999 780.6913 818.2725 842.3313 913.9886 921.7104 923.7236 926.5303 937.0567 957.9010 980.7803 996.2545 1009.4883 1021.2756 1041.6833 1089.1701 1094.2070 1113.0292 1119.7012 1145.3959 1168.3514 1186.5822 1221.9273 1227.4681 1238.4212 1257.4975 1285.4684 1287.6383 1300.9593 1323.1521 1326.0892 1341.8139 1358.8499 1375.0246 1375.3480 1401.6028 1420.4873 1444.8673 1453.1647 1457.6379 1461.7143 1463.2663 1466.0410 1471.3404 1472.1589 1476.5601 1485.9965 1489.4101 1499.1252 1605.0072 2916.2290 2958.3147 2966.9264 2966.9939 2970.3337 2972.4340 2975.7608 2983.2014 2988.7045 3048.4317 3053.4221 3057.0059 3060.0684 3062.2024 3066.8503 3067.8475 3069.9329 3075.7600 3077.8904 3081.1771 3107.3751
redmass: 2.9052 2.8582 2.3033 3.0203 1.9214 1.7373 1.4192 2.2441 1.4047 1.3492 3.2393 1.1314 2.4988 2.2946 2.4044 2.2617 2.5561 2.6375 2.6502 2.7115 2.4859 3.1439 2.8314 3.7785 2.7497 2.1786 2.1993 3.9170 2.7348 2.0697 1.5472 1.5606 1.7638 1.2188 2.4722 1.9289 6.4208 1.7426 1.4607 2.0409 1.4597 2.0017 1.2587 1.6778 1.4474 1.5504 1.6765 1.9974 2.2270 1.8925 1.6656 1.5352 1.4573 1.3895 1.3767 1.4363 1.8412 1.4881 1.2057 1.2039 1.2084 1.1318 1.0537 1.0872 1.0663 1.0840 1.0720 1.0483 1.0881 1.0522 1.0503 1.0522 1.0603 1.0573 8.2060 1.0821 1.0666 1.0573 1.0454 1.0355 1.0302 1.0370 1.0607 1.0603 1.0996 1.0996 1.0994 1.0957 1.0987 1.0979 1.1046 1.0993 1.0980 1.0974 1.0929 1.1021
irintensity: 0.0561 0.0702 6.2243 0.1186 1.2981 3.6738 0.0470 2.5700 0.1009 0.1485 0.5216 0.0416 0.2458 0.8572 0.4191 0.2665 2.0772 11.7721 0.1599 3.0303 0.6769 1.1797 2.0677 4.2247 9.0460 0.8316 18.1817 71.8710 19.0685 0.2081 5.5418 0.2322 4.1575 0.6496 21.8978 7.9663 149.5372 5.8634 1.6345 0.4052 0.4764 2.4424 0.2122 1.2501 3.9327 3.7322 2.4991 3.1841 12.6328 13.6041 8.4343 0.2827 0.8077 4.1431 3.7696 0.7438 3.2687 2.8258 22.4344 26.2575 16.4300 0.2237 10.1297 10.8231 5.4193 19.2400 2.6382 0.9671 3.8119 0.2545 22.7171 9.5624 6.1268 29.9983 7.0590 27.9803 20.9929 41.1882 17.3602 40.8722 102.5309 7.9718 19.0778 57.0538 34.6756 29.6979 2.3390 11.9660 58.4373 102.6280 53.5001 4.8272 65.8743 56.2341 13.3691 25.7797
temp: 298.150 k
press: 1.00000 atm
elementType: 8 7 6 6 6 6 6 6 6 6 6 6 6 1 1 1 1 1 1 1 1 1 1 1 1 1 1 1 1 1 1 1 1 1
symmnumber: 1
zpe: 790155.0 jmol-1
zpe.correction: 0.300954 hartree
zpe.thermalcorrener: 0.316190 hartree
zpe.thermalcorrenthalpy: 0.317134 hartree
zpe.thermalcorrgfe: 0.258919 hartree
zpe.sumelectzpe: -560.628867 hartree
zpe.sumelectthermal: -560.613631 hartree
zpe.sumelectthermalent: -560.612686 hartree
zpe.sumelectthermalfe: -560.670901 hartree
dipole: 1.1244 -0.1548 -0.1693
dipole: 1.1476
quadrupole: -78.3961 -82.3093 -80.8910
quadrupole: 1.7060 -2.0741 -0.5820
quadrupole: 2.1360 -1.7772 -0.3589 1.7060 -2.0741 -0.5820
hfenergy: -560.9298208 hartree
pointgroup: C01 [X(C11H21N1O1)]
dipole: -0.4427266 0.0561985 -0.0684996 debye
polarizability: 175.000781|4.9890484|116.444172|6.9039716|-1.0235092|105.354996 unknown
InChI: InChI=1S/C11H21NO/c1-11(2,3)9-5-7-10(8-6-9)12-13-4/h9H,5-8H2,1-4H3
charge 0 multiplicity 1
34 atoms
O  3.670984 0.688861 0.018969
N  2.886258 -0.56394 0.106923
C  -1.282739 -0.075174 -0.351144
C  -2.743556 0.214765 0.175231
C  -0.598492 -1.295081 0.325226
C  -0.328803 1.147469 -0.258682
C  0.770424 -1.622959 -0.330311
C  1.057197 0.873235 -0.907429
C  -3.634927 -1.042296 -0.0355
C  -2.759278 0.593917 1.681385
C  -3.373792 1.378801 -0.641713
C  1.669015 -0.400931 -0.362041
C  4.99772 0.408343 0.580582
H  -1.396308 -0.322867 -1.432985
H  -1.240818 -2.191871 0.260079
H  -0.439065 -1.08435 1.401348
H  -0.174271 1.416273 0.804951
H  -0.772721 2.029625 -0.754498
H  0.591839 -1.95948 -1.373828
H  1.28154 -2.44594 0.19974
H  1.742104 1.722376 -0.750039
H  0.923298 0.753877 -2.003356
H  -3.330254 -1.88203 0.614351
H  -4.689694 -0.807476 0.2015
H  -3.593624 -1.389283 -1.086224
H  -2.173101 1.50979 1.878641
H  -2.351261 -0.217079 2.311944
H  -3.796958 0.784317 2.014979
H  -3.323743 1.176424 -1.729141
H  -4.439086 1.503017 -0.370202
H  -2.871225 2.343478 -0.449328
H  5.511504 -0.383805 0.005816
H  4.924595 0.103404 1.640684
H  5.549333 1.359489 0.495076
