program: Gaussian 09
title: 000280718
version: EM64L-G09RevD.01
frameworkgroup: C1[X(C8H12S6)]
method: RPBEPBE
basis: SDD
operation: Freq
keyword: #pfreq=noraman
keyword: PBEPBE/SDD
title: #p freq=noraman PBEPBE/SDD
converged: YES YES NO NO
title: Mulliken charges:
elementType: S S S S S S C C C C C C C C H H H H H H H H H H H H
charge: 0.328540 0.328362 0.345146 0.328540 0.345146 0.328362 -0.794572 -0.794570 -0.607164 -0.608635 -0.622873 -0.607164 -0.622873 -0.608635 0.254140 0.282665 0.263992 0.262855 0.283026 0.254140 0.284518 0.282665 0.262855 0.284518 0.263991 0.283026
chargesum: 0.00000
title: Mulliken charges with hydrogens summed into heavy atoms:
elementType: S S S S S S C C C C C C C C
charge: 0.328540 0.328362 0.345146 0.328540 0.345146 0.328362 -0.794572 -0.794570 -0.070360 -0.061618 -0.075500 -0.070360 -0.075500 -0.061617
polarizability: 2.00954722e+02 9.15253522e-05 2.06675656e+02 6.07729192e+00 1.05406597e-05 1.55375542e+02
1716.lowfreq: -0.0024 -0.0023 -0.0023 3.2095 7.3093 12.2218 41.5496 44.2701 86.1133
frequency: 41.5389 44.1222 86.0884 117.4167 130.4534 158.6075 193.6340 193.6572 227.7142 232.0017 250.5705 250.6391 275.4171 303.5130 320.4342 326.2491 392.1449 404.2595 422.4777 435.2722 436.8978 587.0977 616.1708 619.4084 620.9948 624.9712 627.2007 630.7997 662.0434 679.7573 756.6890 778.2981 856.2348 856.3823 863.5226 916.3309 946.1228 948.2774 1007.8164 1008.3290 1030.2992 1053.2215 1109.6928 1110.5486 1135.5165 1146.7410 1149.7398 1174.3261 1256.8010 1257.4702 1267.8053 1286.7919 1290.6651 1293.4933 1419.5055 1424.3377 1425.2863 1425.7303 1435.1735 1435.6882 3006.3384 3014.3301 3022.2324 3022.2784 3029.8395 3030.2854 3081.4379 3093.9103 3098.9144 3098.9207 3115.9355 3116.1892
redmass: 3.5558 4.1311 8.5446 4.4247 5.9909 6.8992 5.4423 8.2424 10.2096 8.9766 2.4902 2.9537 3.1666 7.1014 11.5190 10.9109 15.0736 18.8187 3.0557 3.4159 3.2690 5.3228 5.3013 6.0062 5.6648 7.9591 3.8879 4.0292 12.4709 10.5801 8.1573 9.1942 1.5936 1.6215 1.8428 1.6280 1.5101 1.4832 2.1823 2.1909 2.5499 8.9026 1.0466 1.0492 1.0387 1.4291 1.4520 1.2924 1.2457 1.2441 1.2385 1.1936 1.1756 1.1764 1.0832 1.0874 1.0855 1.0895 1.0985 1.0992 1.0563 1.0599 1.0550 1.0550 1.0589 1.0589 1.1057 1.1057 1.1079 1.1079 1.1084 1.1084
irintensity: 3.0537 3.2442 0.5117 3.6359 0.4297 0.3879 8.1981 1.8921 1.8000 0.0151 3.2444 0.4896 0.8106 0.0306 1.3334 0.0136 2.1441 1.2634 0.2321 0.3589 1.0286 0.0053 0.6129 0.3543 3.2746 15.7979 3.1812 0.3794 49.0389 35.4344 4.5198 10.0303 8.7242 0.0156 10.5745 8.5933 0.1789 6.6183 4.3367 3.7612 0.6573 0.6848 0.5745 0.0506 0.1296 4.5098 0.6914 1.2563 11.3588 2.1198 0.8584 6.6834 12.2066 4.8806 22.5208 26.4281 14.2259 0.4602 9.5552 2.6544 9.7709 46.3529 11.3936 13.7484 59.6754 23.9623 1.4014 6.5633 0.5052 0.2462 17.0791 5.9623
temp: 298.150 k
press: 1.00000 atm
elementType: 16 16 16 16 16 16 6 6 6 6 6 6 6 6 1 1 1 1 1 1 1 1 1 1 1 1
symmnumber: 1
zpe: 488728.4 jmol-1
zpe.correction: 0.186147 hartree
zpe.thermalcorrener: 0.201894 hartree
zpe.thermalcorrenthalpy: 0.202838 hartree
zpe.thermalcorrgfe: 0.142907 hartree
zpe.sumelectzpe: -2699.322318 hartree
zpe.sumelectthermal: -2699.306571 hartree
zpe.sumelectthermalent: -2699.305627 hartree
zpe.sumelectthermalfe: -2699.365558 hartree
dipole: 0.0000 -0.3959 0.0000
dipole: 0.3959
quadrupole: -110.4270 -113.2961 -138.1649
quadrupole: 0.0000 4.1422 0.0000
quadrupole: 10.2023 7.3332 -17.5356 0.0000 4.1422 0.0000
hfenergy: -2699.5084649 hartree
pointgroup: C01 [X(C8H12S6)]
dipole: -0.0000089 -0.155746 0.0000109 debye
dipolederiv: -0.3294658 -0.0985765 0.0160098 -0.0111292 -0.258327 0.1528896 -0.062608 0.092197 -0.1589699 -0.2541335 0.0067506 -0.1455082 -0.0843483 -0.185903 -0.0200143 -0.1937544 0.1860463 -0.2230046 -0.1152335 0.0595171 0.0433494 0.1100159 -0.317441 -0.0541417 0.1025734 -0.0803093 -0.0971602 -0.3294562 0.0985856 0.0159882 0.0111324 -0.2583539 -0.1528846 -0.0626182 -0.0921847 -0.1589524 -0.1152489 -0.0595336 0.0433596 -0.1100286 -0.3174158 0.0541538 0.1025903 0.0803155 -0.0971708 -0.2541261 -0.0067551 -0.1455052 0.0843395 -0.1859229 0.020026 -0.1937785 -0.1860279 -0.2229936 0.357317 -0.0932715 0.0649724 -0.1167175 0.484117 -0.1659744 0.1153623 -0.2394484 0.2582673 0.3573373 0.0932879 0.064983 0.1167391 0.4841244 0.1659516 0.1153803 0.2394196 0.2582393 0.0947853 -0.0224715 0.0064691 -0.0735911 0.050042 0.0769196 0.0042772 0.1614348 0.0508074 0.1205869 -0.0498078 -0.0255107 -0.0188801 0.094699 0.0278117 -0.1397396 0.0172663 0.0561005 0.0860728 -0.0852052 0.0029995 -0.0758269 0.0565422 -0.0705659 0.1168285 -0.172321 0.0875707 0.0947945 0.0224678 0.0064596 0.0735866 0.0500158 -0.0769198 0.0042564 -0.1614344 0.0508242 0.0860906 0.0852041 0.0029999 0.0758333 0.0565431 0.0705673 0.1168397 0.1723098 0.0875532 0.1205919 0.049803 -0.0255174 0.0188668 0.0946884 -0.0278127 -0.1397426 -0.0172551 0.0561043 0.0463153 -0.0479566 0.0544648 -0.0277525 -0.0988128 0.0580115 0.0711043 0.0856013 0.0411397 0.0054814 0.0145474 -0.029301 0.0349868 0.0838326 0.0022869 -0.067677 -0.1053589 -0.0302081 -0.0335919 0.0418641 -0.0813214 0.0332921 0.0942676 0.0093615 -0.1139141 0.0237542 0.0070703 -0.0150028 0.086642 0.0501101 0.1002673 0.012183 -0.0566766 0.0656765 -0.0667735 0.0283601 0.0131473 -0.0132049 0.0337435 -0.0269261 -0.0089265 0.0302326 0.1569176 0.0165801 0.0028188 0.0463228 0.0479458 0.0544557 0.0277429 -0.0988303 -0.0580071 0.0710936 -0.0855987 0.0411495 0.0237027 -0.0212102 0.0095321 -0.014916 -0.0062493 0.0487361 -0.0550387 0.1499184 -0.0227956 0.0054765 -0.0145417 -0.0293001 -0.0349836 0.0838441 -0.0022918 -0.0676641 0.1053577 -0.0302153 -0.0150219 -0.0866354 0.0501223 -0.1002594 0.0122111 0.0566729 0.0656912 0.0667685 0.0283503 0.0237057 0.0212064 0.0095253 0.0149083 -0.0062672 -0.048738 -0.0550553 -0.1499136 -0.0227807 -0.0336007 -0.0418569 -0.0813192 -0.0332872 0.0942731 -0.0093592 -0.1139141 -0.0237487 0.007074 0.0131534 0.013205 0.033739 0.0269354 -0.0089337 -0.0302351 0.1569133 -0.0165954 0.0028218 unknown
polarizability: 201.1566807|0.0003858|206.6756559|5.2618996|-0.0021614|155.173584 unknown
InChI: InChI=1S/C8H12S6/c1-2-10-7(9-1)8(11-3-4-12-8)14-6-5-13-7/h1-6H2
charge 0 multiplicity 1
26 atoms
S  1.160775 1.433929 -1.365078
S  1.827532 -0.017318 1.349033
S  1.155452 -1.559599 -1.27996
S  -1.160409 1.43414 1.364935
S  -1.15538 -1.559393 1.28003
S  -1.827311 -0.017234 -1.349072
C  0.741123 -0.027346 -0.209782
C  -0.7409 -0.027258 0.209743
C  0.733304 2.882628 -0.21513
C  3.222294 -0.952908 0.482059
C  2.597136 -2.166193 -0.205999
C  -0.732793 2.882717 0.214886
C  -2.597134 -2.165914 0.20612
C  -3.222168 -0.952613 -0.482023
H  0.975671 3.780077 -0.813653
H  1.41384 2.823011 0.651398
H  3.941911 -1.240138 1.267934
H  3.306243 -2.662118 -0.891387
H  3.697552 -0.270627 -0.242127
H  -0.97507 3.780231 0.813348
H  2.198643 -2.884549 0.527432
H  -1.413334 2.823109 -0.651638
H  -3.306289 -2.661714 0.891549
H  -2.19872 -2.884364 -0.52726
H  -3.941819 -1.239825 -1.267874
H  -3.697351 -0.27023 0.242115
