program: Gaussian 09
title: 000280763
version: EM64L-G09RevD.01
frameworkgroup: C1[X(C24H24O4)]
method: RPBEPBE
basis: SDD
operation: Freq
keyword: #pfreq=noraman
keyword: PBEPBE/SDD
title: #p freq=noraman PBEPBE/SDD
converged: NO YES NO NO
title: Mulliken charges:
elementType: O O O O C C C C C C C C C C C C C C C C C C C C C C C C H H H H H H H H H H H H H H H H H H H H H H H H
charge: -0.287068 -0.286692 -0.228153 -0.228209 -0.256069 0.333179 -0.451640 -0.607511 0.018203 -0.750246 -0.204201 -0.210240 0.299613 0.315115 -0.405790 -0.389625 -0.378804 -0.379674 -0.336090 -0.342093 -0.397650 -0.397839 0.334242 0.333650 0.265456 0.265937 -0.758411 -0.758383 0.260080 0.217459 0.210083 0.223938 0.254177 0.223569 0.218628 0.235295 0.206641 0.209268 0.249560 0.244734 0.252194 0.252937 0.301534 0.301661 0.254239 0.254043 0.258794 0.250471 0.250216 0.258875 0.250466 0.250134
chargesum: 0.00000
title: Mulliken charges with hydrogens summed into heavy atoms:
elementType: O O O O C C C C C C C C C C C C C C C C C C C C C C C C
charge: -0.287068 -0.286692 -0.228153 -0.228209 0.004010 0.333179 -0.024098 -0.129397 0.018203 -0.072755 0.002440 -0.000972 0.299613 0.315115 -0.156230 -0.144891 -0.126610 -0.126736 -0.034555 -0.040433 -0.143412 -0.143796 0.334242 0.333650 0.265456 0.265937 0.001070 0.001091
polarizability: 3.96801829e+02 5.25411760e+00 3.04448875e+02 -2.09472585e+01 -1.16541514e-01 1.89347893e+02
1716.lowfreq: -69.0450 -49.4197 -3.6553 -1.4267 -0.0008 -0.0005 0.0003 2.5376 19.6629
frequency: -69.0420 -49.4101 19.6591 20.9545 30.4185 36.5014 41.1749 44.8340 59.4901 71.1377 84.0082 95.4302 109.8133 123.5521 141.8941 170.7888 183.3384 198.6013 203.5041 219.9905 244.8892 258.1821 275.9603 308.8415 331.5722 352.0384 358.4543 377.0804 385.1962 395.0160 399.3754 413.0046 416.9737 493.2281 507.1828 518.3463 540.5112 548.7136 552.0975 566.5549 567.0371 593.4314 618.3452 625.9831 648.9376 658.3208 676.0934 678.1370 726.7009 745.3984 747.7306 754.2172 797.0166 838.6531 839.3654 847.6365 857.7643 862.7696 879.0787 885.3759 885.9496 889.2804 913.1993 937.5896 950.6063 966.8978 968.2744 973.2135 982.3205 983.0481 998.7019 998.9824 1003.2354 1009.2284 1012.2367 1025.9976 1044.7194 1044.8459 1077.4255 1086.3505 1111.9351 1115.0867 1147.0324 1149.6863 1152.8536 1160.5445 1172.4789 1177.1604 1189.3627 1197.0520 1200.2722 1206.3859 1243.4129 1275.5286 1286.3153 1297.7583 1305.9987 1314.8230 1329.7975 1341.2137 1357.0848 1361.9312 1378.8970 1382.8597 1384.7996 1385.3373 1407.2289 1408.9930 1446.6693 1454.0527 1454.1572 1454.7570 1458.2509 1458.5978 1475.5404 1482.4412 1484.1441 1487.6920 1571.0117 1571.6312 1607.7568 1609.5479 1616.7528 1647.7438 1648.2702 1679.4030 2923.0570 2952.6937 2978.0552 3001.0052 3008.3379 3008.6679 3027.5984 3037.2108 3071.7234 3086.0472 3094.6078 3094.7106 3095.2798 3126.4932 3137.5895 3140.3065 3140.7057 3142.7038 3144.1327 3144.3835 3168.4275 3168.4841 3207.8286 3208.2127
redmass: 1.0579 1.0882 7.7643 6.7071 4.4325 4.0050 4.2226 3.7576 3.7830 3.7598 4.5094 4.8294 4.2263 5.9104 2.6588 4.7832 5.7221 4.9852 2.9739 1.3162 3.1718 2.9092 5.4753 5.5064 3.8463 4.2103 4.9167 3.7778 2.2974 4.1803 3.2262 3.0184 3.1159 4.2139 3.9249 4.1303 3.2440 3.3868 4.0766 3.3802 3.3727 3.9203 5.6625 6.5823 3.9942 2.1897 2.1454 5.2097 4.5684 4.1932 6.1019 5.3421 3.4649 1.4006 1.6983 1.4247 1.5551 1.9484 2.6032 6.8165 6.4922 3.0302 2.9274 2.1058 2.0523 1.3652 1.3687 1.2979 1.3298 1.3327 1.8802 1.8802 2.0503 2.7196 2.3412 1.8621 1.6006 1.6012 1.9929 1.5863 1.3356 1.3369 2.3074 2.2571 1.3749 2.1713 3.6830 3.1996 1.4569 1.4853 1.3935 1.2202 2.1822 1.7643 2.0377 1.2891 1.7480 1.5517 1.4349 1.5238 5.7595 5.1738 1.5798 1.2133 1.2176 1.2190 3.6478 3.6659 1.0877 1.0758 1.0727 1.0627 1.0457 1.0457 1.0617 1.1376 2.0614 2.6070 7.3640 7.3824 6.4557 6.6872 8.6862 10.9955 10.9556 6.4414 1.0699 1.0617 1.0350 1.0978 1.0368 1.0367 1.0872 1.0851 1.0994 1.0997 1.0839 1.0971 1.0972 1.0998 1.0905 1.0892 1.0894 1.0900 1.1009 1.1009 1.0962 1.0962 1.0940 1.0941
irintensity: 1.3550 1.6129 0.8222 1.3483 1.9908 1.8464 0.9197 0.2109 0.9110 0.7235 0.4992 0.7029 0.8800 0.1460 0.3139 5.2797 1.1357 3.8868 0.8189 0.5938 0.2559 1.8855 0.1061 1.7964 2.1358 0.5251 1.4596 3.4294 0.9279 1.9501 4.9122 1.2876 0.4078 11.8952 10.1910 11.3604 4.4213 2.6951 1.3863 0.4528 0.3130 8.0008 8.6220 0.0397 11.3333 49.0273 12.1795 19.4204 0.3844 6.5049 11.6873 1.4602 7.7590 25.1054 29.4943 7.0125 54.7505 16.6010 5.1344 101.7320 21.1818 8.1993 5.9508 8.7848 2.0924 0.9838 0.7380 0.4241 2.4368 0.2381 106.8960 13.7667 17.4331 14.1069 49.9027 7.6264 9.4502 9.1661 5.2242 2.8082 17.1986 12.1931 433.2063 68.5627 3.5768 19.5760 926.8823 125.5338 28.3360 81.9801 60.4870 12.7283 11.6122 1.2015 3.3797 2.5073 9.6829 4.7945 3.1778 1.9211 20.5017 2.2399 3.0292 17.4669 58.8416 54.6600 7.9670 9.2900 18.2442 17.4422 4.4084 15.6599 17.5480 16.8925 7.2709 13.9753 46.3745 162.7637 6.2595 5.8917 7.3837 1.4506 16.8212 395.8302 45.3075 11.9403 23.1539 42.5283 36.4170 41.2724 4.7862 4.6208 12.1868 12.7211 33.9622 36.4354 6.7845 5.9771 6.0126 77.0502 9.4531 8.6062 9.7862 9.7954 7.4325 7.4918 5.6568 5.0425 3.4555 3.0841
temp: 298.150 k
press: 1.00000 atm
elementType: 8 8 8 8 6 6 6 6 6 6 6 6 6 6 6 6 6 6 6 6 6 6 6 6 6 6 6 6 1 1 1 1 1 1 1 1 1 1 1 1 1 1 1 1 1 1 1 1 1 1 1 1
symmnumber: 1
zpe: 1087745.9 jmol-1
zpe.correction: 0.414301 hartree
zpe.thermalcorrener: 0.439912 hartree
zpe.thermalcorrenthalpy: 0.440856 hartree
zpe.thermalcorrgfe: 0.355444 hartree
zpe.sumelectzpe: -1227.822816 hartree
zpe.sumelectthermal: -1227.797204 hartree
zpe.sumelectthermalent: -1227.796260 hartree
zpe.sumelectthermalfe: -1227.881672 hartree
dipole: 0.1407 -1.6070 0.1787
dipole: 1.6230
quadrupole: -158.3602 -144.4356 -165.3660
quadrupole: 1.1366 14.5801 -0.2844
quadrupole: -2.3063 11.6183 -9.3120 1.1366 14.5801 -0.2844
hfenergy: -1228.2371163 hartree
pointgroup: C01 [X(C24H24O4)]
dipole: 0.0765194 0.6331691 -0.0312312 debye
polarizability: 391.1158995|-9.37665|304.5953509|38.6078075|4.3718495|194.887346 unknown
InChI: InChI=1S/C24H24O4/c1-16-6-4-5-7-23(16)24(19-8-12-21(13-9-19)27-17(2)25)20-10-14-22(15-11-20)28-18(3)26/h4-5,8-16H,6-7H2,1-3H3
charge 0 multiplicity 1
52 atoms
O  4.655485 2.406275 0.063148
O  -4.827138 2.243051 0.256366
O  5.996419 1.439609 1.744264
O  -6.220102 1.453383 -1.474338
C  1.260149 -3.120983 -0.567116
C  -0.013544 -2.316688 -0.299047
C  1.489376 -4.171638 0.55905
C  -1.266601 -3.182557 -0.199706
C  -0.036056 -0.944404 -0.162422
C  1.174033 -3.817197 -1.956752
C  0.217686 -4.917831 0.915919
C  -1.016788 -4.475586 0.564136
C  1.215971 -0.116579 -0.078796
C  -1.312564 -0.157528 -0.082645
C  2.233582 -0.389099 0.873295
C  -2.378642 -0.35694 -0.99997
C  1.390028 1.013061 -0.926544
C  -1.471329 0.861691 0.899293
C  3.400414 0.400735 0.977026
C  -3.57076 0.398767 -0.949091
C  2.545769 1.810766 -0.84826
C  -2.652088 1.621181 0.976686
C  3.547392 1.50023 0.099601
C  -3.697494 1.387089 0.054438
C  5.803181 2.318908 0.878748
C  -6.010176 2.22117 -0.512037
C  6.752903 3.447947 0.540664
C  -6.972902 3.265933 0.010085
H  2.128969 -2.441559 -0.595291
H  1.891858 -3.673564 1.466747
H  2.270081 -4.890622 0.236761
H  -1.648664 -3.442692 -1.21281
H  -2.086112 -2.621127 0.285118
H  0.970287 -3.081023 -2.755429
H  2.133545 -4.315827 -2.188542
H  0.381357 -4.585763 -1.977271
H  0.319357 -5.852466 1.48462
H  -1.907256 -5.059558 0.834738
H  2.100127 -1.22561 1.568444
H  -2.268179 -1.103593 -1.793942
H  0.612159 1.261304 -1.65662
H  -0.661259 1.052673 1.611149
H  4.166505 0.173547 1.718401
H  -4.371662 0.23133 -1.669243
H  2.688839 2.673237 -1.506105
H  -2.781425 2.396583 1.737745
H  6.348753 4.092136 -0.252308
H  7.720786 3.024171 0.220465
H  6.943092 4.04654 1.448514
H  -6.545977 3.820302 0.857102
H  -7.910177 2.772441 0.321425
H  -7.227413 3.965274 -0.805262
