program: Gaussian 09
title: 000025250
version: EM64L-G09RevD.01
frameworkgroup: C1[X(C6H14ClO3P)]
method: RPBEPBE
basis: SDD
operation: Freq
keyword: #p
keyword: freq=noraman
keyword: PBEPBE/SDD
title: #p freq=noraman PBEPBE/SDD
converged: YES YES NO NO
title: Mulliken charges:
elementType: Cl P O O O C C C C C C H H H H H H H H H H H H H H
charge: -0.057247 1.262568 -0.523804 -0.516615 -0.636921 -0.653512 -0.535983 -0.215815 -0.220320 -0.654101 -0.652277 0.291246 0.295869 0.281547 0.293982 0.209869 0.239238 0.243208 0.205505 0.210876 0.228060 0.232608 0.209382 0.232063 0.230573
chargesum: 0.00000
title: Mulliken charges with hydrogens summed into heavy atoms:
elementType: Cl P O O O C C C C C C
charge: -0.057247 1.262568 -0.523804 -0.516615 -0.636921 -0.066397 0.039546 0.233292 0.228393 0.017443 0.019741
polarizability: 1.33464039e+02 -2.20243815e+00 1.13943368e+02 -3.08063872e+00 2.04596484e+00 8.63434202e+01
1716.lowfreq: -14.1862 -8.9878 0.0011 0.0032 0.0035 4.9020 19.8079 26.5249 44.5182
frequency: 13.9901 25.9641 44.4343 44.6558 53.9958 71.0833 78.5064 133.2793 171.7642 214.2710 215.8074 236.3381 241.5772 250.0669 272.2484 317.2610 360.0445 426.2813 465.1635 614.8418 660.8884 697.8752 738.3204 781.1992 808.6001 812.1346 877.7666 886.4148 954.2220 1017.6695 1027.7384 1031.4366 1062.4978 1102.1807 1105.3922 1132.0101 1137.7813 1139.8970 1246.3752 1255.4168 1263.3895 1275.4013 1311.3019 1354.3401 1360.0259 1392.6014 1394.3966 1429.3737 1458.8191 1459.5777 1465.9039 1477.4301 1478.7728 1488.2995 1491.2841 2980.9056 2983.6968 2993.5954 2994.2484 3046.1507 3048.2248 3048.3709 3072.6982 3090.4256 3090.6553 3106.8238 3108.2642 3120.5325 3161.3634
redmass: 2.8364 2.8631 2.6863 3.7009 2.4669 4.6550 2.4651 3.3986 4.7387 3.0134 9.4679 1.2504 2.1600 1.7306 4.3845 3.6405 4.0661 5.9302 8.0564 5.6265 5.8608 6.9963 3.2792 1.3277 1.0994 1.0977 4.1555 3.5359 1.6169 2.6070 3.0459 4.6507 4.3029 2.1651 2.0462 1.1609 1.4580 1.4514 1.1889 1.1383 1.1350 1.1586 1.2380 1.2505 1.2483 1.2441 1.2450 1.0854 1.0404 1.0413 1.0905 1.0505 1.0476 1.0806 1.0837 1.0557 1.0558 1.0369 1.0373 1.1079 1.0830 1.0826 1.0569 1.0983 1.0981 1.1022 1.1021 1.1051 1.1111
irintensity: 0.1435 0.1608 0.4497 0.6459 1.1350 0.2840 1.6039 16.2679 16.1143 5.9211 0.2803 1.3487 3.9482 11.2500 1.2574 7.3817 10.2514 18.8364 72.7598 23.3159 79.8659 53.5214 29.7685 42.6874 3.9698 7.3024 238.3566 138.7758 13.6410 130.2528 143.2821 77.9181 5.7396 0.3296 18.8018 11.3826 1.7817 16.9327 16.6756 0.1401 0.6812 0.1821 21.9878 5.8990 6.4009 29.2516 20.4198 9.9110 11.2855 15.1287 4.6159 4.1514 10.5663 6.2881 7.8613 5.1751 71.7420 27.0590 20.9474 11.0615 8.8967 7.9001 8.6612 7.6349 53.3071 31.3041 39.0012 0.0299 3.7901
temp: 298.150 k
press: 1.00000 atm
elementType: 17 15 8 8 8 6 6 6 6 6 6 1 1 1 1 1 1 1 1 1 1 1 1 1 1
symmnumber: 1
zpe: 524408.6 jmol-1
zpe.correction: 0.199737 hartree
zpe.thermalcorrener: 0.215313 hartree
zpe.thermalcorrenthalpy: 0.216258 hartree
zpe.thermalcorrgfe: 0.152579 hartree
zpe.sumelectzpe: -1263.068377 hartree
zpe.sumelectthermal: -1263.052800 hartree
zpe.sumelectthermalent: -1263.051856 hartree
zpe.sumelectthermalfe: -1263.115534 hartree
dipole: -2.9329 1.3671 -1.2679
dipole: 3.4754
quadrupole: -81.2158 -73.8232 -90.5324
quadrupole: 2.4591 3.5349 -0.7990
quadrupole: 0.6413 8.0339 -8.6752 2.4591 3.5349 -0.7990
hfenergy: -1263.2681132 hartree
pointgroup: C01 [X(C6H14Cl1O3P1)]
dipole: -0.8758735 0.9691441 -0.4039159 debye
dipolederiv: -0.5867519 0.2392406 0.051523 0.2777007 -0.3420567 -0.0553336 0.0932371 -0.0728557 -0.1880473 2.0631046 0.2325489 0.1527981 0.083581 2.0070151 0.0691676 0.2943011 -0.0820587 1.3853636 -0.6398104 -0.0004854 0.0034752 -0.0958581 -1.7055413 -0.1039729 0.0292265 -0.0661344 -0.5306213 -1.7331958 -0.0958934 -0.267846 0.0065702 -0.5451371 -0.0051129 -0.250008 -0.0571732 -0.5951103 -0.7487941 -0.0104832 0.0056914 0.0325465 -0.7213303 -0.0106018 -0.03007 0.0408296 -0.6940169 -0.3419424 0.0350123 -0.0257011 -0.0214423 -0.189014 -0.0328292 -0.0111461 -0.055484 -0.1767973 0.6717561 -0.367766 -0.1312844 -0.2078972 0.3497765 0.0834627 0.0083723 0.0250814 0.2000767 0.24887 -0.2853106 0.0416795 0.0202313 0.9804901 0.0658016 0.0790394 0.320318 0.3045962 1.0770022 0.0502671 0.1816547 -0.129208 0.302147 -0.0773003 -0.2189661 -0.0557516 0.1705719 -0.0159265 -0.0508422 -0.0031515 -0.0942037 -0.1482603 -0.0100841 -0.0115115 -0.0456996 0.0645698 -0.1463674 -0.0788781 -0.0943264 -0.0336052 0.0028677 -0.0430746 -0.0357309 -0.0412057 0.035585 0.0553168 0.004334 0.0137702 -0.0656926 -0.0177395 0.0175903 -0.0014084 0.0140433 0.0944077 0.0672262 0.0226849 0.0246056 -0.0000785 0.1027963 -0.0063165 -0.0311679 0.0204324 -0.0237269 0.0336108 0.0493974 0.0498147 0.0465455 0.0551796 -0.0166526 -0.008579 -0.0077411 -0.0685212 0.0284417 0.0094384 0.027045 -0.0339243 -0.0574395 -0.000728 0.0392056 0.0076131 0.0765666 -0.1152399 0.1035856 -0.0879106 0.0307512 -0.0683869 -0.0051851 -0.1221497 -0.0033373 0.0028601 0.046833 0.0366604 0.0516947 -0.0257277 0.0101515 0.0532419 0.0638098 -0.0440524 -0.0767464 0.0048603 -0.00171 -0.0299783 0.010486 0.0674907 0.0291762 0.0860509 0.0168282 -0.0842815 -0.0767858 0.0056675 -0.0210072 0.0824594 -0.1855549 0.0182647 0.0142171 0.0317723 0.0693395 0.0590145 0.0586149 0.0380973 0.0430916 -0.1459825 -0.0747576 0.0303396 -0.0867086 0.0847321 -0.0619808 0.0102522 -0.0973855 0.0679749 0.0933686 0.0577812 -0.1013746 0.0507973 0.0241963 0.0623369 -0.0415705 0.0478269 -0.0065214 0.1155328 0.0076366 0.0773435 0.0523662 -0.1088424 -0.182108 0.0219144 0.0191067 0.0300425 0.0893184 -0.0322126 0.0341225 -0.0287729 0.0828871 0.1157324 -0.0093777 0.0598615 -0.0263749 0.078209 0.0477526 0.0010157 0.0229511 -0.1261196 0.1147974 0.0626985 -0.0100535 0.0085527 -0.1279003 0.0242863 -0.0281687 0.0439424 0.0770784 unknown
polarizability: 130.3331046|-8.059442|114.9607887|0.6608854|8.0581666|88.4569336 unknown
InChI: InChI=1S/C6H14ClO3P/c1-3-9-11(8,6-5-7)10-4-2/h3-6H2,1-2H3
charge 0 multiplicity 1
25 atoms
Cl 3.829862 -2.458098 -0.599651
P  -0.098338 -0.344396 0.095366
O  0.606499 1.177906 -0.371919
O  -1.387084 -0.695049 -1.01879
O  -0.52655 -0.409047 1.63348
C  1.212872 -1.497787 -0.560848
C  2.576719 -1.20463 0.06007
C  0.057161 2.437359 0.209044
C  -2.793616 -0.396446 -0.615639
C  1.170459 3.479721 0.143008
C  -3.692607 -1.284209 -1.472163
H  0.874858 -2.521635 -0.330186
H  1.228459 -1.368713 -1.654923
H  2.58314 -1.328621 1.152889
H  2.961974 -0.21639 -0.224879
H  -0.817615 2.742629 -0.396981
H  -0.267902 2.244136 1.249399
H  -2.911695 -0.602105 0.465195
H  -2.988611 0.677228 -0.803598
H  0.800774 4.450775 0.521514
H  2.032167 3.16995 0.758471
H  1.512845 3.618206 -0.8967
H  -4.754455 -1.076943 -1.242837
H  -3.522601 -1.091841 -2.545165
H  -3.492414 -2.3503 -1.271657
